hadoop-yarn-dev mailing list archives

Site index · List index
Message view « Date » · « Thread »
Top « Date » · « Thread »
From Apache Jenkins Server <jenk...@builds.apache.org>
Subject Hadoop-Yarn-trunk - Build # 693 - Still Failing
Date Sat, 27 Sep 2014 11:35:55 GMT
See https://builds.apache.org/job/Hadoop-Yarn-trunk/693/

###################################################################################
########################## LAST 60 LINES OF THE CONSOLE ###########################
[...truncated 8862 lines...]
[INFO] ------------------------------------------------------------------------
[INFO] Reactor Summary:
[INFO] 
[INFO] hadoop-yarn ....................................... SUCCESS [  3.197 s]
[INFO] hadoop-yarn-api ................................... SUCCESS [02:17 min]
[INFO] hadoop-yarn-common ................................ SUCCESS [02:16 min]
[INFO] hadoop-yarn-server ................................ SUCCESS [  0.088 s]
[INFO] hadoop-yarn-server-common ......................... SUCCESS [ 33.408 s]
[INFO] hadoop-yarn-server-nodemanager .................... SUCCESS [05:14 min]
[INFO] hadoop-yarn-server-web-proxy ...................... SUCCESS [ 18.124 s]
[INFO] hadoop-yarn-server-applicationhistoryservice ...... SUCCESS [02:21 min]
[INFO] hadoop-yarn-server-resourcemanager ................ SUCCESS [35:36 min]
[INFO] hadoop-yarn-server-tests .......................... SUCCESS [02:13 min]
[INFO] hadoop-yarn-client ................................ SUCCESS [06:36 min]
[INFO] hadoop-yarn-applications .......................... SUCCESS [  0.052 s]
[INFO] hadoop-yarn-applications-distributedshell ......... FAILURE [05:15 min]
[INFO] hadoop-yarn-applications-unmanaged-am-launcher .... SKIPPED
[INFO] hadoop-yarn-site .................................. SKIPPED
[INFO] hadoop-yarn-project ............................... SKIPPED
[INFO] ------------------------------------------------------------------------
[INFO] BUILD FAILURE
[INFO] ------------------------------------------------------------------------
[INFO] Total time: 01:02 h
[INFO] Finished at: 2014-09-27T11:35:17+00:00
[INFO] Final Memory: 87M/750M
[INFO] ------------------------------------------------------------------------
[ERROR] Failed to execute goal org.apache.maven.plugins:maven-surefire-plugin:2.16:test (default-test)
on project hadoop-yarn-applications-distributedshell: There are test failures.
[ERROR] 
[ERROR] Please refer to /home/jenkins/jenkins-slave/workspace/Hadoop-Yarn-trunk/hadoop-yarn-project/hadoop-yarn/hadoop-yarn-applications/hadoop-yarn-applications-distributedshell/target/surefire-reports
for the individual test results.
[ERROR] -> [Help 1]
[ERROR] 
[ERROR] To see the full stack trace of the errors, re-run Maven with the -e switch.
[ERROR] Re-run Maven using the -X switch to enable full debug logging.
[ERROR] 
[ERROR] For more information about the errors and possible solutions, please read the following
articles:
[ERROR] [Help 1] http://cwiki.apache.org/confluence/display/MAVEN/MojoFailureException
[ERROR] 
[ERROR] After correcting the problems, you can resume the build with the command
[ERROR]   mvn <goals> -rf :hadoop-yarn-applications-distributedshell
Build step 'Execute shell' marked build as failure
Archiving artifacts
Updating YARN-2372
Updating MAPREDUCE-5945
Updating HADOOP-8808
Updating HADOOP-10552
Updating MAPREDUCE-6087
Updating HDFS-6584
Updating YARN-2577
Updating HDFS-6664
Updating HDFS-6956
Updating YARN-668
Updating MAPREDUCE-5796
Updating HADOOP-10954
Updating HADOOP-10731
Updating MAPREDUCE-6073
Updating HADOOP-11048
Sending e-mails to: yarn-dev@hadoop.apache.org
Email was triggered for: Failure
Sending email for trigger: Failure



###################################################################################
############################## FAILED TESTS (if any) ##############################
No tests ran.
Mime
  • Unnamed multipart/mixed (inline, None, 0 bytes)
View raw message