hadoop-yarn-dev mailing list archives

Site index · List index
Message view « Date » · « Thread »
Top « Date » · « Thread »
From Apache Jenkins Server <jenk...@builds.apache.org>
Subject Hadoop-Yarn-trunk - Build # 675 - Failure
Date Tue, 09 Sep 2014 11:24:02 GMT
See https://builds.apache.org/job/Hadoop-Yarn-trunk/675/

###################################################################################
########################## LAST 60 LINES OF THE CONSOLE ###########################
[...truncated 8411 lines...]
Results :

Tests in error: 
  TestAMRMClient.testAMRMClientOnAMRMTokenRollOver:954 ? InvalidApplicationMasterRequest

Tests run: 126, Failures: 0, Errors: 1, Skipped: 0

[INFO] ------------------------------------------------------------------------
[INFO] Reactor Summary:
[INFO] 
[INFO] hadoop-yarn ....................................... SUCCESS [  2.913 s]
[INFO] hadoop-yarn-api ................................... SUCCESS [02:07 min]
[INFO] hadoop-yarn-common ................................ SUCCESS [02:03 min]
[INFO] hadoop-yarn-server ................................ SUCCESS [  0.086 s]
[INFO] hadoop-yarn-server-common ......................... SUCCESS [ 36.736 s]
[INFO] hadoop-yarn-server-nodemanager .................... SUCCESS [04:50 min]
[INFO] hadoop-yarn-server-web-proxy ...................... SUCCESS [ 16.934 s]
[INFO] hadoop-yarn-server-applicationhistoryservice ...... SUCCESS [01:24 min]
[INFO] hadoop-yarn-server-resourcemanager ................ SUCCESS [30:35 min]
[INFO] hadoop-yarn-server-tests .......................... SUCCESS [01:35 min]
[INFO] hadoop-yarn-client ................................ FAILURE [06:46 min]
[INFO] hadoop-yarn-applications .......................... SKIPPED
[INFO] hadoop-yarn-applications-distributedshell ......... SKIPPED
[INFO] hadoop-yarn-applications-unmanaged-am-launcher .... SKIPPED
[INFO] hadoop-yarn-site .................................. SKIPPED
[INFO] hadoop-yarn-project ............................... SKIPPED
[INFO] ------------------------------------------------------------------------
[INFO] BUILD FAILURE
[INFO] ------------------------------------------------------------------------
[INFO] Total time: 50:22 min
[INFO] Finished at: 2014-09-09T11:23:56+00:00
[INFO] Final Memory: 87M/951M
[INFO] ------------------------------------------------------------------------
[ERROR] Failed to execute goal org.apache.maven.plugins:maven-surefire-plugin:2.16:test (default-test)
on project hadoop-yarn-client: There are test failures.
[ERROR] 
[ERROR] Please refer to /home/jenkins/jenkins-slave/workspace/Hadoop-Yarn-trunk/hadoop-yarn-project/hadoop-yarn/hadoop-yarn-client/target/surefire-reports
for the individual test results.
[ERROR] -> [Help 1]
[ERROR] 
[ERROR] To see the full stack trace of the errors, re-run Maven with the -e switch.
[ERROR] Re-run Maven using the -X switch to enable full debug logging.
[ERROR] 
[ERROR] For more information about the errors and possible solutions, please read the following
articles:
[ERROR] [Help 1] http://cwiki.apache.org/confluence/display/MAVEN/MojoFailureException
[ERROR] 
[ERROR] After correcting the problems, you can resume the build with the command
[ERROR]   mvn <goals> -rf :hadoop-yarn-client
Build step 'Execute shell' marked build as failure
Archiving artifacts
Updating MAPREDUCE-5972
Updating HDFS-6981
Updating HADOOP-11071
Updating HDFS-6943
Updating HDFS-6893
Updating HDFS-7005
Updating HDFS-6036
Updating HDFS-6951
Sending e-mails to: yarn-dev@hadoop.apache.org
Email was triggered for: Failure
Sending email for trigger: Failure



###################################################################################
############################## FAILED TESTS (if any) ##############################
No tests ran.
Mime
  • Unnamed multipart/mixed (inline, None, 0 bytes)
View raw message