hadoop-yarn-dev mailing list archives

Site index · List index
Message view « Date » · « Thread »
Top « Date » · « Thread »
From Apache Jenkins Server <jenk...@builds.apache.org>
Subject Hadoop-Yarn-trunk - Build # 636 - Still Failing
Date Wed, 06 Aug 2014 19:45:55 GMT
See https://builds.apache.org/job/Hadoop-Yarn-trunk/636/

###################################################################################
########################## LAST 60 LINES OF THE CONSOLE ###########################
[...truncated 15772 lines...]
  TestTimelineWebServices.<init>:151->JerseyTest.<init>:217->JerseyTest.getContainer:342
? TestContainer
  TestTimelineWebServices.<init>:151->JerseyTest.<init>:217->JerseyTest.getContainer:342
? TestContainer
  TestTimelineWebServices.<init>:151->JerseyTest.<init>:217->JerseyTest.getContainer:342
? TestContainer
  TestTimelineWebServices.<init>:151->JerseyTest.<init>:217->JerseyTest.getContainer:342
? TestContainer
  TestTimelineWebServices.<init>:151->JerseyTest.<init>:217->JerseyTest.getContainer:342
? TestContainer
  TestTimelineWebServices.<init>:151->JerseyTest.<init>:217->JerseyTest.getContainer:342
? TestContainer
  TestTimelineWebServices.<init>:151->JerseyTest.<init>:217->JerseyTest.getContainer:342
? TestContainer
  TestTimelineWebServices.<init>:151->JerseyTest.<init>:217->JerseyTest.getContainer:342
? TestContainer
  TestTimelineWebServices.<init>:151->JerseyTest.<init>:217->JerseyTest.getContainer:342
? TestContainer

Tests run: 77, Failures: 0, Errors: 20, Skipped: 0

[INFO] ------------------------------------------------------------------------
[INFO] Reactor Summary:
[INFO] 
[INFO] hadoop-yarn ....................................... SUCCESS [  2.913 s]
[INFO] hadoop-yarn-api ................................... SUCCESS [02:10 min]
[INFO] hadoop-yarn-common ................................ SUCCESS [02:01 min]
[INFO] hadoop-yarn-server ................................ SUCCESS [  0.079 s]
[INFO] hadoop-yarn-server-common ......................... SUCCESS [ 34.294 s]
[INFO] hadoop-yarn-server-nodemanager .................... SUCCESS [04:50 min]
[INFO] hadoop-yarn-server-web-proxy ...................... SUCCESS [ 17.434 s]
[INFO] hadoop-yarn-server-applicationhistoryservice ...... FAILURE [ 47.992 s]
[INFO] hadoop-yarn-server-resourcemanager ................ SKIPPED
[INFO] hadoop-yarn-server-tests .......................... SKIPPED
[INFO] hadoop-yarn-client ................................ SKIPPED
[INFO] hadoop-yarn-applications .......................... SKIPPED
[INFO] hadoop-yarn-applications-distributedshell ......... SKIPPED
[INFO] hadoop-yarn-applications-unmanaged-am-launcher .... SKIPPED
[INFO] hadoop-yarn-site .................................. SKIPPED
[INFO] hadoop-yarn-project ............................... SKIPPED
[INFO] ------------------------------------------------------------------------
[INFO] BUILD FAILURE
[INFO] ------------------------------------------------------------------------
[INFO] Total time: 10:47 min
[INFO] Finished at: 2014-08-06T19:43:41+00:00
[INFO] Final Memory: 79M/980M
[INFO] ------------------------------------------------------------------------
[ERROR] Failed to execute goal org.apache.maven.plugins:maven-surefire-plugin:2.16:test (default-test)
on project hadoop-yarn-server-applicationhistoryservice: There are test failures.
[ERROR] 
[ERROR] Please refer to /home/jenkins/jenkins-slave/workspace/Hadoop-Yarn-trunk/trunk/hadoop-yarn-project/hadoop-yarn/hadoop-yarn-server/hadoop-yarn-server-applicationhistoryservice/target/surefire-reports
for the individual test results.
[ERROR] -> [Help 1]
[ERROR] 
[ERROR] To see the full stack trace of the errors, re-run Maven with the -e switch.
[ERROR] Re-run Maven using the -X switch to enable full debug logging.
[ERROR] 
[ERROR] For more information about the errors and possible solutions, please read the following
articles:
[ERROR] [Help 1] http://cwiki.apache.org/confluence/display/MAVEN/MojoFailureException
[ERROR] 
[ERROR] After correcting the problems, you can resume the build with the command
[ERROR]   mvn <goals> -rf :hadoop-yarn-server-applicationhistoryservice
Build step 'Execute shell' marked build as failure
Archiving artifacts
Updating YARN-2374
Updating HDFS-6791
Updating HDFS-6517
Sending e-mails to: yarn-dev@hadoop.apache.org
Email was triggered for: Failure
Sending email for trigger: Failure



###################################################################################
############################## FAILED TESTS (if any) ##############################
No tests ran.
Mime
  • Unnamed multipart/mixed (inline, None, 0 bytes)
View raw message