hadoop-yarn-dev mailing list archives

Site index · List index
Message view « Date » · « Thread »
Top « Date » · « Thread »
From Apache Jenkins Server <jenk...@builds.apache.org>
Subject Hadoop-Yarn-trunk - Build # 657 - Failure
Date Mon, 25 Aug 2014 10:51:28 GMT
See https://builds.apache.org/job/Hadoop-Yarn-trunk/657/

###################################################################################
########################## LAST 60 LINES OF THE CONSOLE ###########################
[...truncated 15375 lines...]
  TestContainerManager.testContainerSetup:179 ? YarnRuntime java.net.BindExcepti...
  TestContainerManager.testContainerManagerInitialization:147 ? YarnRuntime java...
  TestContainerManager.testStartContainerFailureWithUnknownAuxService:759 ? YarnRuntime
  TestContainerManager.testContainerLaunchAndStop:259 ? YarnRuntime java.net.Bin...
  TestContainerManager.testLocalFilesCleanup:466 ? YarnRuntime java.net.BindExce...
  TestContainerManager.testContainerLaunchFromPreviousRM:573 ? YarnRuntime java....
  TestContainerManager.testContainerLaunchAndExitSuccess:438 ? YarnRuntime java....
  TestContainerManager.testMultipleContainersLaunch:637 ? YarnRuntime java.net.B...
  TestContainerManager.testMultipleContainersStopAndGetStatus:682 ? YarnRuntime ...
  TestContainerLaunch.testImmediateKill:766->internalKillTest:630 ? YarnRuntime ...
  TestContainerLaunch.testContainerEnvVariables:377 ? YarnRuntime java.net.BindE...
  TestContainerLaunch.testDelayedKill:761->internalKillTest:630 ? YarnRuntime ja...

Tests run: 241, Failures: 2, Errors: 32, Skipped: 5

[INFO] ------------------------------------------------------------------------
[INFO] Reactor Summary:
[INFO] 
[INFO] hadoop-yarn ....................................... SUCCESS [  6.403 s]
[INFO] hadoop-yarn-api ................................... SUCCESS [04:08 min]
[INFO] hadoop-yarn-common ................................ SUCCESS [04:10 min]
[INFO] hadoop-yarn-server ................................ SUCCESS [  0.199 s]
[INFO] hadoop-yarn-server-common ......................... SUCCESS [01:16 min]
[INFO] hadoop-yarn-server-nodemanager .................... FAILURE [04:38 min]
[INFO] hadoop-yarn-server-web-proxy ...................... SKIPPED
[INFO] hadoop-yarn-server-applicationhistoryservice ...... SKIPPED
[INFO] hadoop-yarn-server-resourcemanager ................ SKIPPED
[INFO] hadoop-yarn-server-tests .......................... SKIPPED
[INFO] hadoop-yarn-client ................................ SKIPPED
[INFO] hadoop-yarn-applications .......................... SKIPPED
[INFO] hadoop-yarn-applications-distributedshell ......... SKIPPED
[INFO] hadoop-yarn-applications-unmanaged-am-launcher .... SKIPPED
[INFO] hadoop-yarn-site .................................. SKIPPED
[INFO] hadoop-yarn-project ............................... SKIPPED
[INFO] ------------------------------------------------------------------------
[INFO] BUILD FAILURE
[INFO] ------------------------------------------------------------------------
[INFO] Total time: 14:24 min
[INFO] Finished at: 2014-08-25T10:49:00+00:00
[INFO] Final Memory: 82M/1155M
[INFO] ------------------------------------------------------------------------
[ERROR] Failed to execute goal org.apache.maven.plugins:maven-surefire-plugin:2.16:test (default-test)
on project hadoop-yarn-server-nodemanager: There are test failures.
[ERROR] 
[ERROR] Please refer to /home/jenkins/jenkins-slave/workspace/Hadoop-Yarn-trunk/trunk/hadoop-yarn-project/hadoop-yarn/hadoop-yarn-server/hadoop-yarn-server-nodemanager/target/surefire-reports
for the individual test results.
[ERROR] -> [Help 1]
[ERROR] 
[ERROR] To see the full stack trace of the errors, re-run Maven with the -e switch.
[ERROR] Re-run Maven using the -X switch to enable full debug logging.
[ERROR] 
[ERROR] For more information about the errors and possible solutions, please read the following
articles:
[ERROR] [Help 1] http://cwiki.apache.org/confluence/display/MAVEN/MojoFailureException
[ERROR] 
[ERROR] After correcting the problems, you can resume the build with the command
[ERROR]   mvn <goals> -rf :hadoop-yarn-server-nodemanager
Build step 'Execute shell' marked build as failure
Archiving artifacts
Sending e-mails to: yarn-dev@hadoop.apache.org
Email was triggered for: Failure
Sending email for trigger: Failure



###################################################################################
############################## FAILED TESTS (if any) ##############################
No tests ran.
Mime
  • Unnamed multipart/mixed (inline, None, 0 bytes)
View raw message