hadoop-yarn-dev mailing list archives

Site index · List index
Message view « Date » · « Thread »
Top « Date » · « Thread »
From Apache Jenkins Server <jenk...@builds.apache.org>
Subject Failed: YARN-1326 PreCommit Build #4684
Date Thu, 21 Aug 2014 21:28:48 GMT
Jira: https://issues.apache.org/jira/browse/YARN-1326
Build: https://builds.apache.org/job/PreCommit-YARN-Build/4684/

###################################################################################
########################## LAST 60 LINES OF THE CONSOLE ###########################
[...truncated 3073 lines...]
[INFO] Finished at: 2014-08-21T19:22:38+00:00
[INFO] Final Memory: 43M/604M
[INFO] ------------------------------------------------------------------------
[WARNING] The requested profile "native" could not be activated because it does not exist.
[ERROR] Failed to execute goal org.apache.maven.plugins:maven-surefire-plugin:2.16:test (default-test)
on project hadoop-yarn-server-resourcemanager: There are test failures.
[ERROR] 
[ERROR] Please refer to /home/jenkins/jenkins-slave/workspace/PreCommit-YARN-Build/trunk/hadoop-yarn-project/hadoop-yarn/hadoop-yarn-server/hadoop-yarn-server-resourcemanager/target/surefire-reports
for the individual test results.
[ERROR] -> [Help 1]
[ERROR] 
[ERROR] To see the full stack trace of the errors, re-run Maven with the -e switch.
[ERROR] Re-run Maven using the -X switch to enable full debug logging.
[ERROR] 
[ERROR] For more information about the errors and possible solutions, please read the following
articles:
[ERROR] [Help 1] http://cwiki.apache.org/confluence/display/MAVEN/MojoFailureException
/home/jenkins/jenkins-slave/workspace/PreCommit-YARN-Build/trunk


======================================================================
======================================================================
    Running contrib tests.
======================================================================
======================================================================


/bin/grep: build.xml: No such file or directory
FATAL: hudson.remoting.RequestAbortedException: java.io.IOException: Unexpected termination
of the channel
hudson.remoting.RequestAbortedException: hudson.remoting.RequestAbortedException: java.io.IOException:
Unexpected termination of the channel
	at hudson.remoting.RequestAbortedException.wrapForRethrow(RequestAbortedException.java:41)
	at hudson.remoting.RequestAbortedException.wrapForRethrow(RequestAbortedException.java:34)
	at hudson.remoting.Request.call(Request.java:174)
	at hudson.remoting.Channel.call(Channel.java:722)
	at hudson.remoting.RemoteInvocationHandler.invoke(RemoteInvocationHandler.java:167)
	at com.sun.proxy.$Proxy61.join(Unknown Source)
	at hudson.Launcher$RemoteLauncher$ProcImpl.join(Launcher.java:925)
	at hudson.tasks.CommandInterpreter.join(CommandInterpreter.java:137)
	at hudson.tasks.CommandInterpreter.perform(CommandInterpreter.java:97)
	at hudson.tasks.CommandInterpreter.perform(CommandInterpreter.java:66)
	at hudson.tasks.BuildStepMonitor$1.perform(BuildStepMonitor.java:20)
	at hudson.model.AbstractBuild$AbstractBuildExecution.perform(AbstractBuild.java:804)
	at hudson.model.Build$BuildExecution.build(Build.java:199)
	at hudson.model.Build$BuildExecution.doRun(Build.java:160)
	at hudson.model.AbstractBuild$AbstractBuildExecution.run(AbstractBuild.java:585)
	at hudson.model.Run.execute(Run.java:1676)
	at hudson.model.FreeStyleBuild.run(FreeStyleBuild.java:43)
	at hudson.model.ResourceController.execute(ResourceController.java:88)
	at hudson.model.Executor.run(Executor.java:231)
Caused by: hudson.remoting.RequestAbortedException: java.io.IOException: Unexpected termination
of the channel
	at hudson.remoting.Request.abort(Request.java:299)
	at hudson.remoting.Channel.terminate(Channel.java:782)
	at hudson.remoting.SynchronousCommandTransport$ReaderThread.run(SynchronousCommandTransport.java:69)
Caused by: java.io.IOException: Unexpected termination of the channel
	at hudson.remoting.SynchronousCommandTransport$ReaderThread.run(SynchronousCommandTransport.java:50)
Caused by: java.io.EOFException
	at java.io.ObjectInputStream$BlockDataInputStream.peekByte(ObjectInputStream.java:2598)
	at java.io.ObjectInputStream.readObject0(ObjectInputStream.java:1318)
	at java.io.ObjectInputStream.readObject(ObjectInputStream.java:370)
	at hudson.remoting.Command.readFrom(Command.java:92)
	at hudson.remoting.ClassicCommandTransport.read(ClassicCommandTransport.java:71)
	at hudson.remoting.SynchronousCommandTransport$ReaderThread.run(SynchronousCommandTransport.java:48)



###################################################################################
############################## FAILED TESTS (if any) ##############################
No tests ran.
Mime
  • Unnamed multipart/mixed (inline, None, 0 bytes)
View raw message