hadoop-yarn-dev mailing list archives

Site index · List index
Message view « Date » · « Thread »
Top « Date » · « Thread »
From Apache Jenkins Server <jenk...@builds.apache.org>
Subject Failed: YARN-2277 PreCommit Build #4583
Date Mon, 11 Aug 2014 04:53:07 GMT
Jira: https://issues.apache.org/jira/browse/YARN-2277
Build: https://builds.apache.org/job/PreCommit-YARN-Build/4583/

###################################################################################
########################## LAST 60 LINES OF THE CONSOLE ###########################
[...truncated 3879 lines...]
  http://issues.apache.org/jira/secure/attachment/12660911/YARN-2277-v5.patch
  against trunk revision .

    {color:green}+1 @author{color}.  The patch does not contain any @author tags.

    {color:green}+1 tests included{color}.  The patch appears to include 2 new or modified
test files.

    {color:green}+1 javac{color}.  The applied patch does not increase the total number of
javac compiler warnings.

    {color:green}+1 javadoc{color}.  There were no new javadoc warning messages.

    {color:green}+1 eclipse:eclipse{color}.  The patch built with eclipse:eclipse.

    {color:green}+1 findbugs{color}.  The patch does not introduce any new Findbugs (version
2.0.3) warnings.

    {color:green}+1 release audit{color}.  The applied patch does not increase the total number
of release audit warnings.

    {color:red}-1 core tests{color}.  The patch failed these unit tests in hadoop-common-project/hadoop-common:

                  org.apache.hadoop.http.TestCrossOriginFilter

    {color:green}+1 contrib tests{color}.  The patch passed contrib unit tests.

Test results: https://builds.apache.org/job/PreCommit-YARN-Build/4583//testReport/
Console output: https://builds.apache.org/job/PreCommit-YARN-Build/4583//console

This message is automatically generated.


======================================================================
======================================================================
    Adding comment to Jira.
======================================================================
======================================================================


Comment added.
306be96998e4e7a169692fcc44ecbee6a3882043 logged out


======================================================================
======================================================================
    Finished build.
======================================================================
======================================================================


Build step 'Execute shell' marked build as failure
Archiving artifacts
Sending artifact delta relative to PreCommit-YARN-Build #4582
Archived 17 artifacts
Archive block size is 32768
Received 222 blocks and 1640152 bytes
Compression is 81.6%
Took 2.5 sec
[description-setter] Could not determine description.
Recording test results
Email was triggered for: Failure
Sending email for trigger: Failure



###################################################################################
############################## FAILED TESTS (if any) ##############################
1 tests failed.
FAILED:  org.apache.hadoop.http.TestCrossOriginFilter.testSameOrigin

Error Message:
null

Stack Trace:
java.lang.NullPointerException: null
	at java.net.URLEncoder.encode(URLEncoder.java:188)
	at org.apache.hadoop.http.CrossOriginFilter.doCrossFilter(CrossOriginFilter.java:90)
	at org.apache.hadoop.http.CrossOriginFilter.doFilter(CrossOriginFilter.java:73)
	at org.apache.hadoop.http.TestCrossOriginFilter.testSameOrigin(TestCrossOriginFilter.java:62)



Mime
  • Unnamed multipart/mixed (inline, None, 0 bytes)
View raw message