hadoop-yarn-dev mailing list archives

Site index · List index
Message view « Date » · « Thread »
Top « Date » · « Thread »
From Apache Jenkins Server <jenk...@builds.apache.org>
Subject Hadoop-Yarn-trunk - Build # 654 - Still Failing
Date Fri, 22 Aug 2014 11:00:58 GMT
See https://builds.apache.org/job/Hadoop-Yarn-trunk/654/

###################################################################################
########################## LAST 60 LINES OF THE CONSOLE ###########################
[...truncated 15370 lines...]
  TestContainerLaunch.testContainerEnvVariables:377 ? YarnRuntime java.net.BindE...
  TestContainerLaunch.testDelayedKill:761->internalKillTest:630 ? YarnRuntime ja...

Tests run: 241, Failures: 1, Errors: 32, Skipped: 5

[INFO] ------------------------------------------------------------------------
[INFO] Reactor Summary:
[INFO] 
[INFO] hadoop-yarn ....................................... SUCCESS [  6.644 s]
[INFO] hadoop-yarn-api ................................... SUCCESS [04:28 min]
[INFO] hadoop-yarn-common ................................ SUCCESS [04:25 min]
[INFO] hadoop-yarn-server ................................ SUCCESS [  0.133 s]
[INFO] hadoop-yarn-server-common ......................... SUCCESS [01:23 min]
[INFO] hadoop-yarn-server-nodemanager .................... FAILURE [04:45 min]
[INFO] hadoop-yarn-server-web-proxy ...................... SKIPPED
[INFO] hadoop-yarn-server-applicationhistoryservice ...... SKIPPED
[INFO] hadoop-yarn-server-resourcemanager ................ SKIPPED
[INFO] hadoop-yarn-server-tests .......................... SKIPPED
[INFO] hadoop-yarn-client ................................ SKIPPED
[INFO] hadoop-yarn-applications .......................... SKIPPED
[INFO] hadoop-yarn-applications-distributedshell ......... SKIPPED
[INFO] hadoop-yarn-applications-unmanaged-am-launcher .... SKIPPED
[INFO] hadoop-yarn-site .................................. SKIPPED
[INFO] hadoop-yarn-project ............................... SKIPPED
[INFO] ------------------------------------------------------------------------
[INFO] BUILD FAILURE
[INFO] ------------------------------------------------------------------------
[INFO] Total time: 15:11 min
[INFO] Finished at: 2014-08-22T10:58:25+00:00
[INFO] Final Memory: 80M/1155M
[INFO] ------------------------------------------------------------------------
[ERROR] Failed to execute goal org.apache.maven.plugins:maven-surefire-plugin:2.16:test (default-test)
on project hadoop-yarn-server-nodemanager: There are test failures.
[ERROR] 
[ERROR] Please refer to /home/jenkins/jenkins-slave/workspace/Hadoop-Yarn-trunk/trunk/hadoop-yarn-project/hadoop-yarn/hadoop-yarn-server/hadoop-yarn-server-nodemanager/target/surefire-reports
for the individual test results.
[ERROR] -> [Help 1]
[ERROR] 
[ERROR] To see the full stack trace of the errors, re-run Maven with the -e switch.
[ERROR] Re-run Maven using the -X switch to enable full debug logging.
[ERROR] 
[ERROR] For more information about the errors and possible solutions, please read the following
articles:
[ERROR] [Help 1] http://cwiki.apache.org/confluence/display/MAVEN/MojoFailureException
[ERROR] 
[ERROR] After correcting the problems, you can resume the build with the command
[ERROR]   mvn <goals> -rf :hadoop-yarn-server-nodemanager
Build step 'Execute shell' marked build as failure
Archiving artifacts
Updating MAPREDUCE-5974
Updating HADOOP-10989
Updating HDFS-6890
Updating HADOOP-10992
Updating MAPREDUCE-5130
Updating HADOOP-10893
Updating YARN-2434
Updating HADOOP-9902
Updating HADOOP-8896
Updating YARN-2436
Sending e-mails to: yarn-dev@hadoop.apache.org
Email was triggered for: Failure
Sending email for trigger: Failure



###################################################################################
############################## FAILED TESTS (if any) ##############################
No tests ran.
Mime
  • Unnamed multipart/mixed (inline, None, 0 bytes)
View raw message