hadoop-yarn-dev mailing list archives

Site index · List index
Message view « Date » · « Thread »
Top « Date » · « Thread »
From Mike <m...@unitedrmr.com>
Subject Re: Failed: YARN-2051 PreCommit Build #4301
Date Tue, 15 Jul 2014 04:33:32 GMT
Unsubscribe

> On Jul 14, 2014, at 8:50 PM, Apache Jenkins Server <jenkins@builds.apache.org>
wrote:
> 
> Jira: https://issues.apache.org/jira/browse/YARN-2051
> Build: https://builds.apache.org/job/PreCommit-YARN-Build/4301/
> 
> ###################################################################################
> ########################## LAST 60 LINES OF THE CONSOLE ###########################
> [...truncated 13108 lines...]
>  http://issues.apache.org/jira/secure/attachment/12655677/YARN-2051.v1.patch
>  against trunk revision .
> 
>    {color:green}+1 @author{color}.  The patch does not contain any @author tags.
> 
>    {color:green}+1 tests included{color}.  The patch appears to include 1 new or modified
test files.
> 
>    {color:green}+1 javac{color}.  The applied patch does not increase the total number
of javac compiler warnings.
> 
>    {color:green}+1 javadoc{color}.  There were no new javadoc warning messages.
> 
>    {color:green}+1 eclipse:eclipse{color}.  The patch built with eclipse:eclipse.
> 
>    {color:green}+1 findbugs{color}.  The patch does not introduce any new Findbugs (version
2.0.3) warnings.
> 
>    {color:green}+1 release audit{color}.  The applied patch does not increase the total
number of release audit warnings.
> 
>    {color:red}-1 core tests{color}.  The patch failed these unit tests in hadoop-yarn-project/hadoop-yarn/hadoop-yarn-api
hadoop-yarn-project/hadoop-yarn/hadoop-yarn-common:
> 
>                  org.apache.hadoop.yarn.util.TestFSDownload
> 
>    {color:green}+1 contrib tests{color}.  The patch passed contrib unit tests.
> 
> Test results: https://builds.apache.org/job/PreCommit-YARN-Build/4301//testReport/
> Console output: https://builds.apache.org/job/PreCommit-YARN-Build/4301//console
> 
> This message is automatically generated.
> 
> 
> ======================================================================
> ======================================================================
>    Adding comment to Jira.
> ======================================================================
> ======================================================================
> 
> 
> Comment added.
> feed8b2545160280dbd257bd2f3a9ba7957b78dd logged out
> 
> 
> ======================================================================
> ======================================================================
>    Finished build.
> ======================================================================
> ======================================================================
> 
> 
> Build step 'Execute shell' marked build as failure
> Archiving artifacts
> Sending artifact delta relative to PreCommit-YARN-Build #4299
> Archived 22 artifacts
> Archive block size is 32768
> Received 45 blocks and 7104760 bytes
> Compression is 17.2%
> Took 2.2 sec
> [description-setter] Could not determine description.
> Recording test results
> Email was triggered for: Failure
> Sending email for trigger: Failure
> 
> 
> 
> ###################################################################################
> ############################## FAILED TESTS (if any) ##############################
> 1 tests failed.
> FAILED:  org.apache.hadoop.yarn.util.TestFSDownload.testDownloadPublicWithStatCache
> 
> Error Message:
> null
> 
> Stack Trace:
> java.lang.AssertionError: null
>    at org.junit.Assert.fail(Assert.java:86)
>    at org.junit.Assert.assertTrue(Assert.java:41)
>    at org.junit.Assert.assertTrue(Assert.java:52)
>    at org.apache.hadoop.yarn.util.TestFSDownload.testDownloadPublicWithStatCache(TestFSDownload.java:363)
> 
> 

Mime
View raw message