hadoop-yarn-dev mailing list archives

Site index · List index
Message view « Date » · « Thread »
Top « Date » · « Thread »
From Apache Jenkins Server <jenk...@builds.apache.org>
Subject Failed: YARN-2211 PreCommit Build #4388
Date Tue, 22 Jul 2014 01:14:01 GMT
Jira: https://issues.apache.org/jira/browse/YARN-2211
Build: https://builds.apache.org/job/PreCommit-YARN-Build/4388/

###################################################################################
########################## LAST 60 LINES OF THE CONSOLE ###########################
[...truncated 13697 lines...]
  against trunk revision .

    {color:green}+1 @author{color}.  The patch does not contain any @author tags.

    {color:green}+1 tests included{color}.  The patch appears to include 9 new or modified
test files.

    {color:green}+1 javac{color}.  The applied patch does not increase the total number of
javac compiler warnings.

    {color:green}+1 javadoc{color}.  There were no new javadoc warning messages.

    {color:green}+1 eclipse:eclipse{color}.  The patch built with eclipse:eclipse.

    {color:green}+1 findbugs{color}.  The patch does not introduce any new Findbugs (version
2.0.3) warnings.

    {color:green}+1 release audit{color}.  The applied patch does not increase the total number
of release audit warnings.

    {color:red}-1 core tests{color}.  The patch failed these unit tests in hadoop-yarn-project/hadoop-yarn/hadoop-yarn-api
hadoop-yarn-project/hadoop-yarn/hadoop-yarn-client hadoop-yarn-project/hadoop-yarn/hadoop-yarn-server/hadoop-yarn-server-common
hadoop-yarn-project/hadoop-yarn/hadoop-yarn-server/hadoop-yarn-server-nodemanager hadoop-yarn-project/hadoop-yarn/hadoop-yarn-server/hadoop-yarn-server-resourcemanager:

                  org.apache.hadoop.yarn.server.resourcemanager.scheduler.fair.TestFairScheduler
                  org.apache.hadoop.yarn.server.resourcemanager.applicationsmanager.TestAMRestart

    {color:green}+1 contrib tests{color}.  The patch passed contrib unit tests.

Test results: https://builds.apache.org/job/PreCommit-YARN-Build/4388//testReport/
Console output: https://builds.apache.org/job/PreCommit-YARN-Build/4388//console

This message is automatically generated.


======================================================================
======================================================================
    Adding comment to Jira.
======================================================================
======================================================================


Comment added.
9fbc50b626b43682d54c3909d9af3b1f6561e2af logged out


======================================================================
======================================================================
    Finished build.
======================================================================
======================================================================


Build step 'Execute shell' marked build as failure
Archiving artifacts
Sending artifact delta relative to PreCommit-YARN-Build #4384
Archived 37 artifacts
Archive block size is 32768
Received 45 blocks and 7528907 bytes
Compression is 16.4%
Took 2.7 sec
[description-setter] Could not determine description.
Recording test results
Email was triggered for: Failure
Sending email for trigger: Failure



###################################################################################
############################## FAILED TESTS (if any) ##############################
2 tests failed.
FAILED:  org.apache.hadoop.yarn.server.resourcemanager.applicationsmanager.TestAMRestart.testShouldNotCountFailureToMaxAttemptRetry

Error Message:
AppAttempt state is not correct (timedout) expected:<ALLOCATED> but was:<SCHEDULED>

Stack Trace:
java.lang.AssertionError: AppAttempt state is not correct (timedout) expected:<ALLOCATED>
but was:<SCHEDULED>
	at org.junit.Assert.fail(Assert.java:88)
	at org.junit.Assert.failNotEquals(Assert.java:743)
	at org.junit.Assert.assertEquals(Assert.java:118)
	at org.apache.hadoop.yarn.server.resourcemanager.MockAM.waitForState(MockAM.java:82)
	at org.apache.hadoop.yarn.server.resourcemanager.MockRM.sendAMLaunched(MockRM.java:414)
	at org.apache.hadoop.yarn.server.resourcemanager.MockRM.launchAM(MockRM.java:569)
	at org.apache.hadoop.yarn.server.resourcemanager.MockRM.launchAndRegisterAM(MockRM.java:576)
	at org.apache.hadoop.yarn.server.resourcemanager.applicationsmanager.TestAMRestart.testShouldNotCountFailureToMaxAttemptRetry(TestAMRestart.java:401)


FAILED:  org.apache.hadoop.yarn.server.resourcemanager.scheduler.fair.TestFairScheduler.testContinuousScheduling

Error Message:
expected:<2> but was:<1>

Stack Trace:
java.lang.AssertionError: expected:<2> but was:<1>
	at org.junit.Assert.fail(Assert.java:88)
	at org.junit.Assert.failNotEquals(Assert.java:743)
	at org.junit.Assert.assertEquals(Assert.java:118)
	at org.junit.Assert.assertEquals(Assert.java:555)
	at org.junit.Assert.assertEquals(Assert.java:542)
	at org.apache.hadoop.yarn.server.resourcemanager.scheduler.fair.TestFairScheduler.testContinuousScheduling(TestFairScheduler.java:2763)



Mime
  • Unnamed multipart/mixed (inline, None, 0 bytes)
View raw message