hadoop-yarn-dev mailing list archives

Site index · List index
Message view « Date » · « Thread »
Top « Date » · « Thread »
From Apache Jenkins Server <jenk...@builds.apache.org>
Subject Hadoop-Yarn-trunk - Build # 624 - Still Failing
Date Sat, 26 Jul 2014 11:27:55 GMT
See https://builds.apache.org/job/Hadoop-Yarn-trunk/624/

###################################################################################
########################## LAST 60 LINES OF THE CONSOLE ###########################
[...truncated 16848 lines...]
Failed tests: 
  TestDistributedShell.testDSShell:188 null

Tests run: 8, Failures: 1, Errors: 0, Skipped: 0

[INFO] ------------------------------------------------------------------------
[INFO] Reactor Summary:
[INFO] 
[INFO] hadoop-yarn ....................................... SUCCESS [  2.997 s]
[INFO] hadoop-yarn-api ................................... SUCCESS [02:12 min]
[INFO] hadoop-yarn-common ................................ SUCCESS [01:57 min]
[INFO] hadoop-yarn-server ................................ SUCCESS [  0.079 s]
[INFO] hadoop-yarn-server-common ......................... SUCCESS [ 32.387 s]
[INFO] hadoop-yarn-server-nodemanager .................... SUCCESS [04:55 min]
[INFO] hadoop-yarn-server-web-proxy ...................... SUCCESS [ 17.270 s]
[INFO] hadoop-yarn-server-applicationhistoryservice ...... SUCCESS [01:14 min]
[INFO] hadoop-yarn-server-resourcemanager ................ SUCCESS [28:04 min]
[INFO] hadoop-yarn-server-tests .......................... SUCCESS [01:22 min]
[INFO] hadoop-yarn-client ................................ SUCCESS [09:18 min]
[INFO] hadoop-yarn-applications .......................... SUCCESS [  0.047 s]
[INFO] hadoop-yarn-applications-distributedshell ......... FAILURE [03:39 min]
[INFO] hadoop-yarn-applications-unmanaged-am-launcher .... SKIPPED
[INFO] hadoop-yarn-site .................................. SKIPPED
[INFO] hadoop-yarn-project ............................... SKIPPED
[INFO] ------------------------------------------------------------------------
[INFO] BUILD FAILURE
[INFO] ------------------------------------------------------------------------
[INFO] Total time: 53:40 min
[INFO] Finished at: 2014-07-26T11:26:10+00:00
[INFO] Final Memory: 87M/1005M
[INFO] ------------------------------------------------------------------------
[ERROR] Failed to execute goal org.apache.maven.plugins:maven-surefire-plugin:2.16:test (default-test)
on project hadoop-yarn-applications-distributedshell: There are test failures.
[ERROR] 
[ERROR] Please refer to /home/jenkins/jenkins-slave/workspace/Hadoop-Yarn-trunk/trunk/hadoop-yarn-project/hadoop-yarn/hadoop-yarn-applications/hadoop-yarn-applications-distributedshell/target/surefire-reports
for the individual test results.
[ERROR] -> [Help 1]
[ERROR] 
[ERROR] To see the full stack trace of the errors, re-run Maven with the -e switch.
[ERROR] Re-run Maven using the -X switch to enable full debug logging.
[ERROR] 
[ERROR] For more information about the errors and possible solutions, please read the following
articles:
[ERROR] [Help 1] http://cwiki.apache.org/confluence/display/MAVEN/MojoFailureException
[ERROR] 
[ERROR] After correcting the problems, you can resume the build with the command
[ERROR]   mvn <goals> -rf :hadoop-yarn-applications-distributedshell
Build step 'Execute shell' marked build as failure
Archiving artifacts
Updating HDFS-6755
Updating YARN-2335
Updating HDFS-6750
Updating HDFS-6752
Updating YARN-1726
Updating YARN-2214
Updating HADOOP-10896
Updating YARN-2211
Updating HDFS-6749
Updating YARN-1796
Sending e-mails to: yarn-dev@hadoop.apache.org
Email was triggered for: Failure
Sending email for trigger: Failure



###################################################################################
############################## FAILED TESTS (if any) ##############################
No tests ran.
Mime
  • Unnamed multipart/mixed (inline, None, 0 bytes)
View raw message