hadoop-yarn-dev mailing list archives

Site index · List index
Message view « Date » · « Thread »
Top « Date » · « Thread »
From Apache Jenkins Server <jenk...@builds.apache.org>
Subject Failed: YARN-2209 PreCommit Build #4424
Date Fri, 25 Jul 2014 03:13:34 GMT
Jira: https://issues.apache.org/jira/browse/YARN-2209
Build: https://builds.apache.org/job/PreCommit-YARN-Build/4424/

###################################################################################
########################## LAST 60 LINES OF THE CONSOLE ###########################
[...truncated 11944 lines...]

    {color:green}+1 @author{color}.  The patch does not contain any @author tags.

    {color:green}+1 tests included{color}.  The patch appears to include 7 new or modified
test files.

    {color:green}+1 javac{color}.  The applied patch does not increase the total number of
javac compiler warnings.

    {color:green}+1 javadoc{color}.  There were no new javadoc warning messages.

    {color:green}+1 eclipse:eclipse{color}.  The patch built with eclipse:eclipse.

    {color:green}+1 findbugs{color}.  The patch does not introduce any new Findbugs (version
2.0.3) warnings.

    {color:green}+1 release audit{color}.  The applied patch does not increase the total number
of release audit warnings.

    {color:red}-1 core tests{color}.  The patch failed these unit tests in hadoop-mapreduce-project/hadoop-mapreduce-client/hadoop-mapreduce-client-app
hadoop-yarn-project/hadoop-yarn/hadoop-yarn-api hadoop-yarn-project/hadoop-yarn/hadoop-yarn-client
hadoop-yarn-project/hadoop-yarn/hadoop-yarn-common hadoop-yarn-project/hadoop-yarn/hadoop-yarn-server/hadoop-yarn-server-resourcemanager:

                  org.apache.hadoop.yarn.client.TestApplicationMasterServiceOnHA
                  org.apache.hadoop.yarn.client.api.impl.TestAMRMClientOnRMRestart
                  org.apache.hadoop.yarn.server.resourcemanager.applicationsmanager.TestAMRestart

    {color:green}+1 contrib tests{color}.  The patch passed contrib unit tests.

Test results: https://builds.apache.org/job/PreCommit-YARN-Build/4424//testReport/
Console output: https://builds.apache.org/job/PreCommit-YARN-Build/4424//console

This message is automatically generated.


======================================================================
======================================================================
    Adding comment to Jira.
======================================================================
======================================================================


Comment added.
5931af86159d8bebea832477ca36287b06f14747 logged out


======================================================================
======================================================================
    Finished build.
======================================================================
======================================================================


Build step 'Execute shell' marked build as failure
Archiving artifacts
Sending artifact delta relative to PreCommit-YARN-Build #4423
Archived 37 artifacts
Archive block size is 32768
Received 54 blocks and 7312363 bytes
Compression is 19.5%
Took 5.2 sec
[description-setter] Could not determine description.
Recording test results
Email was triggered for: Failure
Sending email for trigger: Failure



###################################################################################
############################## FAILED TESTS (if any) ##############################
3 tests failed.
FAILED:  org.apache.hadoop.yarn.client.TestApplicationMasterServiceOnHA.testAllocateOnHA

Error Message:
Given AMRMToken for application : appattempt_1000_0001_000000 seems to have been generated
illegally.

Stack Trace:
org.apache.hadoop.security.token.SecretManager$InvalidToken: Given AMRMToken for application
: appattempt_1000_0001_000000 seems to have been generated illegally.
	at org.apache.hadoop.ipc.Client.call(Client.java:1411)
	at org.apache.hadoop.ipc.Client.call(Client.java:1364)
	at org.apache.hadoop.ipc.ProtobufRpcEngine$Invoker.invoke(ProtobufRpcEngine.java:206)
	at com.sun.proxy.$Proxy85.allocate(Unknown Source)
	at org.apache.hadoop.yarn.api.impl.pb.client.ApplicationMasterProtocolPBClientImpl.allocate(ApplicationMasterProtocolPBClientImpl.java:77)
	at sun.reflect.NativeMethodAccessorImpl.invoke0(Native Method)
	at sun.reflect.NativeMethodAccessorImpl.invoke(NativeMethodAccessorImpl.java:39)
	at sun.reflect.DelegatingMethodAccessorImpl.invoke(DelegatingMethodAccessorImpl.java:25)
	at java.lang.reflect.Method.invoke(Method.java:597)
	at org.apache.hadoop.io.retry.RetryInvocationHandler.invokeMethod(RetryInvocationHandler.java:186)
	at org.apache.hadoop.io.retry.RetryInvocationHandler.invoke(RetryInvocationHandler.java:101)
	at com.sun.proxy.$Proxy86.allocate(Unknown Source)
	at org.apache.hadoop.yarn.client.TestApplicationMasterServiceOnHA.testAllocateOnHA(TestApplicationMasterServiceOnHA.java:84)


FAILED:  org.apache.hadoop.yarn.client.api.impl.TestAMRMClientOnRMRestart.testAMRMClientResendsRequestsOnRMRestart

Error Message:
expected:<0> but was:<1>

Stack Trace:
java.lang.AssertionError: expected:<0> but was:<1>
	at org.junit.Assert.fail(Assert.java:88)
	at org.junit.Assert.failNotEquals(Assert.java:743)
	at org.junit.Assert.assertEquals(Assert.java:118)
	at org.junit.Assert.assertEquals(Assert.java:555)
	at org.junit.Assert.assertEquals(Assert.java:542)
	at org.apache.hadoop.yarn.client.api.impl.TestAMRMClientOnRMRestart.assertAsksAndReleases(TestAMRMClientOnRMRestart.java:488)
	at org.apache.hadoop.yarn.client.api.impl.TestAMRMClientOnRMRestart.testAMRMClientResendsRequestsOnRMRestart(TestAMRMClientOnRMRestart.java:260)


REGRESSION:  org.apache.hadoop.yarn.server.resourcemanager.applicationsmanager.TestAMRestart.testShouldNotCountFailureToMaxAttemptRetry

Error Message:
AppAttempt state is not correct (timedout) expected:<ALLOCATED> but was:<SCHEDULED>

Stack Trace:
java.lang.AssertionError: AppAttempt state is not correct (timedout) expected:<ALLOCATED>
but was:<SCHEDULED>
	at org.junit.Assert.fail(Assert.java:88)
	at org.junit.Assert.failNotEquals(Assert.java:743)
	at org.junit.Assert.assertEquals(Assert.java:118)
	at org.apache.hadoop.yarn.server.resourcemanager.MockAM.waitForState(MockAM.java:82)
	at org.apache.hadoop.yarn.server.resourcemanager.MockRM.sendAMLaunched(MockRM.java:414)
	at org.apache.hadoop.yarn.server.resourcemanager.MockRM.launchAM(MockRM.java:569)
	at org.apache.hadoop.yarn.server.resourcemanager.MockRM.launchAndRegisterAM(MockRM.java:576)
	at org.apache.hadoop.yarn.server.resourcemanager.applicationsmanager.TestAMRestart.testShouldNotCountFailureToMaxAttemptRetry(TestAMRestart.java:401)



Mime
  • Unnamed multipart/mixed (inline, None, 0 bytes)
View raw message