hadoop-yarn-dev mailing list archives

Site index · List index
Message view « Date » · « Thread »
Top « Date » · « Thread »
From Apache Jenkins Server <jenk...@builds.apache.org>
Subject Failed: YARN-1366 PreCommit Build #4155
Date Tue, 01 Jul 2014 06:29:39 GMT
Jira: https://issues.apache.org/jira/browse/YARN-1366
Build: https://builds.apache.org/job/PreCommit-YARN-Build/4155/

###################################################################################
########################## LAST 60 LINES OF THE CONSOLE ###########################
[...truncated 2916 lines...]
  against trunk revision .

    {color:green}+1 @author{color}.  The patch does not contain any @author tags.

    {color:green}+1 tests included{color}.  The patch appears to include 3 new or modified
test files.

    {color:green}+1 javac{color}.  The applied patch does not increase the total number of
javac compiler warnings.

    {color:green}+1 javadoc{color}.  There were no new javadoc warning messages.

    {color:green}+1 eclipse:eclipse{color}.  The patch built with eclipse:eclipse.

    {color:green}+1 findbugs{color}.  The patch does not introduce any new Findbugs (version
1.3.9) warnings.

    {color:green}+1 release audit{color}.  The applied patch does not increase the total number
of release audit warnings.

    {color:red}-1 core tests{color}.  The patch failed these unit tests in hadoop-yarn-project/hadoop-yarn/hadoop-yarn-client:

                  org.apache.hadoop.yarn.client.api.impl.TestAMRMClientOnRMRestart

    {color:green}+1 contrib tests{color}.  The patch passed contrib unit tests.

Test results: https://builds.apache.org/job/PreCommit-YARN-Build/4155//testReport/
Console output: https://builds.apache.org/job/PreCommit-YARN-Build/4155//console

This message is automatically generated.


======================================================================
======================================================================
    Adding comment to Jira.
======================================================================
======================================================================


Comment added.
5cd77bdbd4d75a8d72b7164a9ec1bb30b9413e7b logged out


======================================================================
======================================================================
    Finished build.
======================================================================
======================================================================


Build step 'Execute shell' marked build as failure
Archiving artifacts
Sending artifact delta relative to PreCommit-YARN-Build #4153
Archived 17 artifacts
Archive block size is 32768
Received 40 blocks and 6850055 bytes
Compression is 16.1%
Took 5 sec
[description-setter] Could not determine description.
Recording test results
Publish JUnit test result report is waiting for a checkpoint on PreCommit-YARN-Build #4154
Email was triggered for: Failure
Sending email for trigger: Failure



###################################################################################
############################## FAILED TESTS (if any) ##############################
1 tests failed.
FAILED:  org.apache.hadoop.yarn.client.api.impl.TestAMRMClientOnRMRestart.testAMRMClientForUnregisterAMOnRMRestart

Error Message:
Attempt to unregister before registering.

Stack Trace:
java.lang.AssertionError: Attempt to unregister before registering.
	at org.junit.Assert.fail(Assert.java:88)
	at org.junit.Assert.assertTrue(Assert.java:41)
	at org.apache.hadoop.yarn.client.api.impl.TestAMRMClientOnRMRestart.testAMRMClientForUnregisterAMOnRMRestart(TestAMRMClientOnRMRestart.java:338)



Mime
  • Unnamed multipart/mixed (inline, None, 0 bytes)
View raw message