hadoop-yarn-dev mailing list archives

Site index · List index
Message view « Date » · « Thread »
Top « Date » · « Thread »
From Apache Jenkins Server <jenk...@builds.apache.org>
Subject Failed: YARN-2228 PreCommit Build #4277
Date Fri, 11 Jul 2014 18:05:27 GMT
Jira: https://issues.apache.org/jira/browse/YARN-2228
Build: https://builds.apache.org/job/PreCommit-YARN-Build/4277/

###################################################################################
########################## LAST 60 LINES OF THE CONSOLE ###########################
[...truncated 13254 lines...]

    {color:green}+1 @author{color}.  The patch does not contain any @author tags.

    {color:green}+1 tests included{color}.  The patch appears to include 2 new or modified
test files.

    {color:green}+1 javac{color}.  The applied patch does not increase the total number of
javac compiler warnings.

    {color:green}+1 javadoc{color}.  There were no new javadoc warning messages.

    {color:green}+1 eclipse:eclipse{color}.  The patch built with eclipse:eclipse.

    {color:green}+1 findbugs{color}.  The patch does not introduce any new Findbugs (version
2.0.3) warnings.

    {color:green}+1 release audit{color}.  The applied patch does not increase the total number
of release audit warnings.

    {color:red}-1 core tests{color}.  The patch failed these unit tests in hadoop-yarn-project/hadoop-yarn/hadoop-yarn-client
hadoop-yarn-project/hadoop-yarn/hadoop-yarn-common hadoop-yarn-project/hadoop-yarn/hadoop-yarn-server/hadoop-yarn-server-applicationhistoryservice:

                  org.apache.hadoop.yarn.client.TestRMFailover
                  org.apache.hadoop.yarn.util.TestFSDownload

    {color:green}+1 contrib tests{color}.  The patch passed contrib unit tests.

Test results: https://builds.apache.org/job/PreCommit-YARN-Build/4277//testReport/
Console output: https://builds.apache.org/job/PreCommit-YARN-Build/4277//console

This message is automatically generated.


======================================================================
======================================================================
    Adding comment to Jira.
======================================================================
======================================================================


Comment added.
95f87b938a0be2e9cff6a0e3060795aa8c45b145 logged out


======================================================================
======================================================================
    Finished build.
======================================================================
======================================================================


Build step 'Execute shell' marked build as failure
Archiving artifacts
Sending artifact delta relative to PreCommit-YARN-Build #4272
Archived 27 artifacts
Archive block size is 32768
Received 50 blocks and 6842830 bytes
Compression is 19.3%
Took 2.1 sec
[description-setter] Could not determine description.
Recording test results
Publish JUnit test result report is waiting for a checkpoint on PreCommit-YARN-Build #4276
Email was triggered for: Failure
Sending email for trigger: Failure



###################################################################################
############################## FAILED TESTS (if any) ##############################
2 tests failed.
FAILED:  org.apache.hadoop.yarn.client.TestRMFailover.testAutomaticFailover

Error Message:
Failover failed expected:<1> but was:<-1>

Stack Trace:
java.lang.AssertionError: Failover failed expected:<1> but was:<-1>
	at org.junit.Assert.fail(Assert.java:88)
	at org.junit.Assert.failNotEquals(Assert.java:743)
	at org.junit.Assert.assertEquals(Assert.java:118)
	at org.junit.Assert.assertEquals(Assert.java:555)
	at org.apache.hadoop.yarn.client.TestRMFailover.failover(TestRMFailover.java:154)
	at org.apache.hadoop.yarn.client.TestRMFailover.testAutomaticFailover(TestRMFailover.java:189)


FAILED:  org.apache.hadoop.yarn.util.TestFSDownload.testDownloadPublicWithStatCache

Error Message:
null

Stack Trace:
java.lang.AssertionError: null
	at org.junit.Assert.fail(Assert.java:86)
	at org.junit.Assert.assertTrue(Assert.java:41)
	at org.junit.Assert.assertTrue(Assert.java:52)
	at org.apache.hadoop.yarn.util.TestFSDownload.testDownloadPublicWithStatCache(TestFSDownload.java:363)



Mime
  • Unnamed multipart/mixed (inline, None, 0 bytes)
View raw message