hadoop-yarn-dev mailing list archives

Site index · List index
Message view « Date » · « Thread »
Top « Date » · « Thread »
From Apache Jenkins Server <jenk...@builds.apache.org>
Subject Hadoop-Yarn-trunk - Build # 622 - Still Failing
Date Thu, 24 Jul 2014 11:23:41 GMT
See https://builds.apache.org/job/Hadoop-Yarn-trunk/622/

###################################################################################
########################## LAST 60 LINES OF THE CONSOLE ###########################
[...truncated 16591 lines...]
  TestApplicationMasterServiceOnHA.testAllocateOnHA:84 ? InvalidToken Given AMRM...

Tests run: 128, Failures: 0, Errors: 1, Skipped: 0

[INFO] ------------------------------------------------------------------------
[INFO] Reactor Summary:
[INFO] 
[INFO] hadoop-yarn ....................................... SUCCESS [  2.922 s]
[INFO] hadoop-yarn-api ................................... SUCCESS [02:10 min]
[INFO] hadoop-yarn-common ................................ SUCCESS [02:01 min]
[INFO] hadoop-yarn-server ................................ SUCCESS [  0.081 s]
[INFO] hadoop-yarn-server-common ......................... SUCCESS [ 36.889 s]
[INFO] hadoop-yarn-server-nodemanager .................... SUCCESS [04:53 min]
[INFO] hadoop-yarn-server-web-proxy ...................... SUCCESS [ 17.554 s]
[INFO] hadoop-yarn-server-applicationhistoryservice ...... SUCCESS [01:13 min]
[INFO] hadoop-yarn-server-resourcemanager ................ SUCCESS [28:02 min]
[INFO] hadoop-yarn-server-tests .......................... SUCCESS [01:21 min]
[INFO] hadoop-yarn-client ................................ FAILURE [08:42 min]
[INFO] hadoop-yarn-applications .......................... SKIPPED
[INFO] hadoop-yarn-applications-distributedshell ......... SKIPPED
[INFO] hadoop-yarn-applications-unmanaged-am-launcher .... SKIPPED
[INFO] hadoop-yarn-site .................................. SKIPPED
[INFO] hadoop-yarn-project ............................... SKIPPED
[INFO] ------------------------------------------------------------------------
[INFO] BUILD FAILURE
[INFO] ------------------------------------------------------------------------
[INFO] Total time: 49:25 min
[INFO] Finished at: 2014-07-24T11:21:51+00:00
[INFO] Final Memory: 87M/788M
[INFO] ------------------------------------------------------------------------
[ERROR] Failed to execute goal org.apache.maven.plugins:maven-surefire-plugin:2.16:test (default-test)
on project hadoop-yarn-client: There are test failures.
[ERROR] 
[ERROR] Please refer to /home/jenkins/jenkins-slave/workspace/Hadoop-Yarn-trunk/trunk/hadoop-yarn-project/hadoop-yarn/hadoop-yarn-client/target/surefire-reports
for the individual test results.
[ERROR] -> [Help 1]
[ERROR] 
[ERROR] To see the full stack trace of the errors, re-run Maven with the -e switch.
[ERROR] Re-run Maven using the -X switch to enable full debug logging.
[ERROR] 
[ERROR] For more information about the errors and possible solutions, please read the following
articles:
[ERROR] [Help 1] http://cwiki.apache.org/confluence/display/MAVEN/MojoFailureException
[ERROR] 
[ERROR] After correcting the problems, you can resume the build with the command
[ERROR]   mvn <goals> -rf :hadoop-yarn-client
Build step 'Execute shell' marked build as failure
Archiving artifacts
Updating HDFS-6422
Updating YARN-1342
Updating HADOOP-10872
Updating HADOOP-10887
Updating HDFS-6455
Updating YARN-2147
Updating HDFS-6114
Updating YARN-2300
Updating HADOOP-10882
Updating HADOOP-10830
Updating HADOOP-10890
Sending e-mails to: yarn-dev@hadoop.apache.org
Email was triggered for: Failure
Sending email for trigger: Failure



###################################################################################
############################## FAILED TESTS (if any) ##############################
No tests ran.
Mime
  • Unnamed multipart/mixed (inline, None, 0 bytes)
View raw message