hadoop-yarn-dev mailing list archives

Site index · List index
Message view « Date » · « Thread »
Top « Date » · « Thread »
From Apache Jenkins Server <jenk...@builds.apache.org>
Subject Failed: YARN-2181 PreCommit Build #4074
Date Wed, 25 Jun 2014 07:52:15 GMT
Jira: https://issues.apache.org/jira/browse/YARN-2181
Build: https://builds.apache.org/job/PreCommit-YARN-Build/4074/

###################################################################################
########################## LAST 60 LINES OF THE CONSOLE ###########################
[...truncated 3204 lines...]

    {color:green}+1 @author{color}.  The patch does not contain any @author tags.

    {color:green}+1 tests included{color}.  The patch appears to include 6 new or modified
test files.

    {color:green}+1 javac{color}.  The applied patch does not increase the total number of
javac compiler warnings.

    {color:green}+1 javadoc{color}.  There were no new javadoc warning messages.

    {color:green}+1 eclipse:eclipse{color}.  The patch built with eclipse:eclipse.

    {color:red}-1 findbugs{color}.  The patch appears to introduce 1 new Findbugs (version
1.3.9) warnings.

    {color:green}+1 release audit{color}.  The applied patch does not increase the total number
of release audit warnings.

    {color:red}-1 core tests{color}.  The patch failed these unit tests in hadoop-yarn-project/hadoop-yarn/hadoop-yarn-server/hadoop-yarn-server-resourcemanager:

                  org.apache.hadoop.yarn.server.resourcemanager.webapp.TestRMWebServicesApps
                  org.apache.hadoop.yarn.server.resourcemanager.webapp.TestRMWebServicesCapacitySched

    {color:green}+1 contrib tests{color}.  The patch passed contrib unit tests.

Test results: https://builds.apache.org/job/PreCommit-YARN-Build/4074//testReport/
Findbugs warnings: https://builds.apache.org/job/PreCommit-YARN-Build/4074//artifact/trunk/patchprocess/newPatchFindbugsWarningshadoop-yarn-server-resourcemanager.html
Console output: https://builds.apache.org/job/PreCommit-YARN-Build/4074//console

This message is automatically generated.


======================================================================
======================================================================
    Adding comment to Jira.
======================================================================
======================================================================


Comment added.
31de6e0461adac5ab9a3c7e8386491135ddec974 logged out


======================================================================
======================================================================
    Finished build.
======================================================================
======================================================================


Build step 'Execute shell' marked build as failure
Archiving artifacts
Sending artifact delta relative to PreCommit-YARN-Build #4071
Archived 17 artifacts
Archive block size is 32768
Received 37 blocks and 6985508 bytes
Compression is 14.8%
Took 5.4 sec
[description-setter] Could not determine description.
Recording test results
Email was triggered for: Failure
Sending email for trigger: Failure



###################################################################################
############################## FAILED TESTS (if any) ##############################
13 tests failed.
REGRESSION:  org.apache.hadoop.yarn.server.resourcemanager.webapp.TestRMWebServicesApps.testAppsSlash

Error Message:
incorrect number of elements expected:<22> but was:<20>

Stack Trace:
java.lang.AssertionError: incorrect number of elements expected:<22> but was:<20>
	at org.junit.Assert.fail(Assert.java:88)
	at org.junit.Assert.failNotEquals(Assert.java:743)
	at org.junit.Assert.assertEquals(Assert.java:118)
	at org.junit.Assert.assertEquals(Assert.java:555)
	at org.apache.hadoop.yarn.server.resourcemanager.webapp.TestRMWebServicesApps.verifyAppInfo(TestRMWebServicesApps.java:1323)
	at org.apache.hadoop.yarn.server.resourcemanager.webapp.TestRMWebServicesApps.testAppsHelper(TestRMWebServicesApps.java:220)
	at org.apache.hadoop.yarn.server.resourcemanager.webapp.TestRMWebServicesApps.testAppsSlash(TestRMWebServicesApps.java:141)


REGRESSION:  org.apache.hadoop.yarn.server.resourcemanager.webapp.TestRMWebServicesApps.testAppsXML

Error Message:
null

Stack Trace:
java.lang.NumberFormatException: null
	at java.lang.Integer.parseInt(Integer.java:417)
	at java.lang.Integer.parseInt(Integer.java:499)
	at org.apache.hadoop.yarn.webapp.WebServicesTestUtils.getXmlInt(WebServicesTestUtils.java:37)
	at org.apache.hadoop.yarn.server.resourcemanager.webapp.TestRMWebServicesApps.verifyAppsXML(TestRMWebServicesApps.java:1294)
	at org.apache.hadoop.yarn.server.resourcemanager.webapp.TestRMWebServicesApps.testAppsXML(TestRMWebServicesApps.java:176)


REGRESSION:  org.apache.hadoop.yarn.server.resourcemanager.webapp.TestRMWebServicesApps.testApps

Error Message:
incorrect number of elements expected:<22> but was:<20>

Stack Trace:
java.lang.AssertionError: incorrect number of elements expected:<22> but was:<20>
	at org.junit.Assert.fail(Assert.java:88)
	at org.junit.Assert.failNotEquals(Assert.java:743)
	at org.junit.Assert.assertEquals(Assert.java:118)
	at org.junit.Assert.assertEquals(Assert.java:555)
	at org.apache.hadoop.yarn.server.resourcemanager.webapp.TestRMWebServicesApps.verifyAppInfo(TestRMWebServicesApps.java:1323)
	at org.apache.hadoop.yarn.server.resourcemanager.webapp.TestRMWebServicesApps.testAppsHelper(TestRMWebServicesApps.java:220)
	at org.apache.hadoop.yarn.server.resourcemanager.webapp.TestRMWebServicesApps.testApps(TestRMWebServicesApps.java:131)


REGRESSION:  org.apache.hadoop.yarn.server.resourcemanager.webapp.TestRMWebServicesApps.testSingleAppsXML

Error Message:
null

Stack Trace:
java.lang.NumberFormatException: null
	at java.lang.Integer.parseInt(Integer.java:417)
	at java.lang.Integer.parseInt(Integer.java:499)
	at org.apache.hadoop.yarn.webapp.WebServicesTestUtils.getXmlInt(WebServicesTestUtils.java:37)
	at org.apache.hadoop.yarn.server.resourcemanager.webapp.TestRMWebServicesApps.verifyAppsXML(TestRMWebServicesApps.java:1294)
	at org.apache.hadoop.yarn.server.resourcemanager.webapp.TestRMWebServicesApps.testSingleAppsXML(TestRMWebServicesApps.java:1284)


REGRESSION:  org.apache.hadoop.yarn.server.resourcemanager.webapp.TestRMWebServicesApps.testSingleAppsSlash

Error Message:
incorrect number of elements expected:<22> but was:<20>

Stack Trace:
java.lang.AssertionError: incorrect number of elements expected:<22> but was:<20>
	at org.junit.Assert.fail(Assert.java:88)
	at org.junit.Assert.failNotEquals(Assert.java:743)
	at org.junit.Assert.assertEquals(Assert.java:118)
	at org.junit.Assert.assertEquals(Assert.java:555)
	at org.apache.hadoop.yarn.server.resourcemanager.webapp.TestRMWebServicesApps.verifyAppInfo(TestRMWebServicesApps.java:1323)
	at org.apache.hadoop.yarn.server.resourcemanager.webapp.TestRMWebServicesApps.testSingleAppsHelper(TestRMWebServicesApps.java:1261)
	at org.apache.hadoop.yarn.server.resourcemanager.webapp.TestRMWebServicesApps.testSingleAppsSlash(TestRMWebServicesApps.java:1164)


REGRESSION:  org.apache.hadoop.yarn.server.resourcemanager.webapp.TestRMWebServicesApps.testSingleApp

Error Message:
incorrect number of elements expected:<22> but was:<20>

Stack Trace:
java.lang.AssertionError: incorrect number of elements expected:<22> but was:<20>
	at org.junit.Assert.fail(Assert.java:88)
	at org.junit.Assert.failNotEquals(Assert.java:743)
	at org.junit.Assert.assertEquals(Assert.java:118)
	at org.junit.Assert.assertEquals(Assert.java:555)
	at org.apache.hadoop.yarn.server.resourcemanager.webapp.TestRMWebServicesApps.verifyAppInfo(TestRMWebServicesApps.java:1323)
	at org.apache.hadoop.yarn.server.resourcemanager.webapp.TestRMWebServicesApps.testSingleAppsHelper(TestRMWebServicesApps.java:1261)
	at org.apache.hadoop.yarn.server.resourcemanager.webapp.TestRMWebServicesApps.testSingleApp(TestRMWebServicesApps.java:1153)


REGRESSION:  org.apache.hadoop.yarn.server.resourcemanager.webapp.TestRMWebServicesApps.testAppsQueryFinalStatus

Error Message:
incorrect number of elements expected:<22> but was:<20>

Stack Trace:
java.lang.AssertionError: incorrect number of elements expected:<22> but was:<20>
	at org.junit.Assert.fail(Assert.java:88)
	at org.junit.Assert.failNotEquals(Assert.java:743)
	at org.junit.Assert.assertEquals(Assert.java:118)
	at org.junit.Assert.assertEquals(Assert.java:555)
	at org.apache.hadoop.yarn.server.resourcemanager.webapp.TestRMWebServicesApps.verifyAppInfo(TestRMWebServicesApps.java:1323)
	at org.apache.hadoop.yarn.server.resourcemanager.webapp.TestRMWebServicesApps.testAppsQueryFinalStatus(TestRMWebServicesApps.java:476)


REGRESSION:  org.apache.hadoop.yarn.server.resourcemanager.webapp.TestRMWebServicesApps.testAppsQueryState

Error Message:
incorrect number of elements expected:<22> but was:<20>

Stack Trace:
java.lang.AssertionError: incorrect number of elements expected:<22> but was:<20>
	at org.junit.Assert.fail(Assert.java:88)
	at org.junit.Assert.failNotEquals(Assert.java:743)
	at org.junit.Assert.assertEquals(Assert.java:118)
	at org.junit.Assert.assertEquals(Assert.java:555)
	at org.apache.hadoop.yarn.server.resourcemanager.webapp.TestRMWebServicesApps.verifyAppInfo(TestRMWebServicesApps.java:1323)
	at org.apache.hadoop.yarn.server.resourcemanager.webapp.TestRMWebServicesApps.testAppsQueryState(TestRMWebServicesApps.java:243)


REGRESSION:  org.apache.hadoop.yarn.server.resourcemanager.webapp.TestRMWebServicesApps.testSingleAppsDefault

Error Message:
incorrect number of elements expected:<22> but was:<20>

Stack Trace:
java.lang.AssertionError: incorrect number of elements expected:<22> but was:<20>
	at org.junit.Assert.fail(Assert.java:88)
	at org.junit.Assert.failNotEquals(Assert.java:743)
	at org.junit.Assert.assertEquals(Assert.java:118)
	at org.junit.Assert.assertEquals(Assert.java:555)
	at org.apache.hadoop.yarn.server.resourcemanager.webapp.TestRMWebServicesApps.verifyAppInfo(TestRMWebServicesApps.java:1323)
	at org.apache.hadoop.yarn.server.resourcemanager.webapp.TestRMWebServicesApps.testSingleAppsHelper(TestRMWebServicesApps.java:1261)
	at org.apache.hadoop.yarn.server.resourcemanager.webapp.TestRMWebServicesApps.testSingleAppsDefault(TestRMWebServicesApps.java:1175)


REGRESSION:  org.apache.hadoop.yarn.server.resourcemanager.webapp.TestRMWebServicesApps.testAppsDefault

Error Message:
incorrect number of elements expected:<22> but was:<20>

Stack Trace:
java.lang.AssertionError: incorrect number of elements expected:<22> but was:<20>
	at org.junit.Assert.fail(Assert.java:88)
	at org.junit.Assert.failNotEquals(Assert.java:743)
	at org.junit.Assert.assertEquals(Assert.java:118)
	at org.junit.Assert.assertEquals(Assert.java:555)
	at org.apache.hadoop.yarn.server.resourcemanager.webapp.TestRMWebServicesApps.verifyAppInfo(TestRMWebServicesApps.java:1323)
	at org.apache.hadoop.yarn.server.resourcemanager.webapp.TestRMWebServicesApps.testAppsHelper(TestRMWebServicesApps.java:220)
	at org.apache.hadoop.yarn.server.resourcemanager.webapp.TestRMWebServicesApps.testAppsDefault(TestRMWebServicesApps.java:151)


REGRESSION:  org.apache.hadoop.yarn.server.resourcemanager.webapp.TestRMWebServicesCapacitySched.testClusterScheduler

Error Message:
incorrect number of elements expected:<21> but was:<24>

Stack Trace:
java.lang.AssertionError: incorrect number of elements expected:<21> but was:<24>
	at org.junit.Assert.fail(Assert.java:88)
	at org.junit.Assert.failNotEquals(Assert.java:743)
	at org.junit.Assert.assertEquals(Assert.java:118)
	at org.junit.Assert.assertEquals(Assert.java:555)
	at org.apache.hadoop.yarn.server.resourcemanager.webapp.TestRMWebServicesCapacitySched.verifySubQueue(TestRMWebServicesCapacitySched.java:366)
	at org.apache.hadoop.yarn.server.resourcemanager.webapp.TestRMWebServicesCapacitySched.verifySubQueue(TestRMWebServicesCapacitySched.java:387)
	at org.apache.hadoop.yarn.server.resourcemanager.webapp.TestRMWebServicesCapacitySched.verifySubQueue(TestRMWebServicesCapacitySched.java:387)
	at org.apache.hadoop.yarn.server.resourcemanager.webapp.TestRMWebServicesCapacitySched.verifyClusterScheduler(TestRMWebServicesCapacitySched.java:343)
	at org.apache.hadoop.yarn.server.resourcemanager.webapp.TestRMWebServicesCapacitySched.testClusterScheduler(TestRMWebServicesCapacitySched.java:187)


REGRESSION:  org.apache.hadoop.yarn.server.resourcemanager.webapp.TestRMWebServicesCapacitySched.testClusterSchedulerDefault

Error Message:
incorrect number of elements expected:<21> but was:<24>

Stack Trace:
java.lang.AssertionError: incorrect number of elements expected:<21> but was:<24>
	at org.junit.Assert.fail(Assert.java:88)
	at org.junit.Assert.failNotEquals(Assert.java:743)
	at org.junit.Assert.assertEquals(Assert.java:118)
	at org.junit.Assert.assertEquals(Assert.java:555)
	at org.apache.hadoop.yarn.server.resourcemanager.webapp.TestRMWebServicesCapacitySched.verifySubQueue(TestRMWebServicesCapacitySched.java:366)
	at org.apache.hadoop.yarn.server.resourcemanager.webapp.TestRMWebServicesCapacitySched.verifySubQueue(TestRMWebServicesCapacitySched.java:387)
	at org.apache.hadoop.yarn.server.resourcemanager.webapp.TestRMWebServicesCapacitySched.verifySubQueue(TestRMWebServicesCapacitySched.java:387)
	at org.apache.hadoop.yarn.server.resourcemanager.webapp.TestRMWebServicesCapacitySched.verifyClusterScheduler(TestRMWebServicesCapacitySched.java:343)
	at org.apache.hadoop.yarn.server.resourcemanager.webapp.TestRMWebServicesCapacitySched.testClusterSchedulerDefault(TestRMWebServicesCapacitySched.java:208)


REGRESSION:  org.apache.hadoop.yarn.server.resourcemanager.webapp.TestRMWebServicesCapacitySched.testClusterSchedulerSlash

Error Message:
incorrect number of elements expected:<21> but was:<24>

Stack Trace:
java.lang.AssertionError: incorrect number of elements expected:<21> but was:<24>
	at org.junit.Assert.fail(Assert.java:88)
	at org.junit.Assert.failNotEquals(Assert.java:743)
	at org.junit.Assert.assertEquals(Assert.java:118)
	at org.junit.Assert.assertEquals(Assert.java:555)
	at org.apache.hadoop.yarn.server.resourcemanager.webapp.TestRMWebServicesCapacitySched.verifySubQueue(TestRMWebServicesCapacitySched.java:366)
	at org.apache.hadoop.yarn.server.resourcemanager.webapp.TestRMWebServicesCapacitySched.verifySubQueue(TestRMWebServicesCapacitySched.java:387)
	at org.apache.hadoop.yarn.server.resourcemanager.webapp.TestRMWebServicesCapacitySched.verifySubQueue(TestRMWebServicesCapacitySched.java:387)
	at org.apache.hadoop.yarn.server.resourcemanager.webapp.TestRMWebServicesCapacitySched.verifyClusterScheduler(TestRMWebServicesCapacitySched.java:343)
	at org.apache.hadoop.yarn.server.resourcemanager.webapp.TestRMWebServicesCapacitySched.testClusterSchedulerSlash(TestRMWebServicesCapacitySched.java:198)



Mime
  • Unnamed multipart/mixed (inline, None, 0 bytes)
View raw message