hadoop-yarn-dev mailing list archives

Site index · List index
Message view « Date » · « Thread »
Top « Date » · « Thread »
From Apache Jenkins Server <jenk...@builds.apache.org>
Subject Hadoop-Yarn-trunk - Build # 572 - Still Failing
Date Tue, 03 Jun 2014 12:25:55 GMT
See https://builds.apache.org/job/Hadoop-Yarn-trunk/572/

###################################################################################
########################## LAST 60 LINES OF THE CONSOLE ###########################
[...truncated 16165 lines...]
  TestRMAdminCLI.testHelp:307->testError:366 null

Tests in error: 
  TestRMAdminCLI.testTransitionToActive:180 ยป UnsupportedOperation

Tests run: 126, Failures: 1, Errors: 1, Skipped: 0

[INFO] ------------------------------------------------------------------------
[INFO] Reactor Summary:
[INFO] 
[INFO] hadoop-yarn ....................................... SUCCESS [4.085s]
[INFO] hadoop-yarn-api ................................... SUCCESS [3:22.729s]
[INFO] hadoop-yarn-common ................................ SUCCESS [2:23.381s]
[INFO] hadoop-yarn-server ................................ SUCCESS [0.084s]
[INFO] hadoop-yarn-server-common ......................... SUCCESS [38.336s]
[INFO] hadoop-yarn-server-nodemanager .................... SUCCESS [4:48.279s]
[INFO] hadoop-yarn-server-web-proxy ...................... SUCCESS [23.772s]
[INFO] hadoop-yarn-server-applicationhistoryservice ...... SUCCESS [1:26.859s]
[INFO] hadoop-yarn-server-resourcemanager ................ SUCCESS [21:08.781s]
[INFO] hadoop-yarn-server-tests .......................... SUCCESS [1:22.349s]
[INFO] hadoop-yarn-client ................................ FAILURE [8:13.606s]
[INFO] hadoop-yarn-applications .......................... SKIPPED
[INFO] hadoop-yarn-applications-distributedshell ......... SKIPPED
[INFO] hadoop-yarn-applications-unmanaged-am-launcher .... SKIPPED
[INFO] hadoop-yarn-site .................................. SKIPPED
[INFO] hadoop-yarn-project ............................... SKIPPED
[INFO] ------------------------------------------------------------------------
[INFO] BUILD FAILURE
[INFO] ------------------------------------------------------------------------
[INFO] Total time: 43:54.762s
[INFO] Finished at: Tue Jun 03 11:49:44 UTC 2014
[INFO] Final Memory: 61M/781M
[INFO] ------------------------------------------------------------------------
[ERROR] Failed to execute goal org.apache.maven.plugins:maven-surefire-plugin:2.16:test (default-test)
on project hadoop-yarn-client: There are test failures.
[ERROR] 
[ERROR] Please refer to /home/jenkins/jenkins-slave/workspace/Hadoop-Yarn-trunk/trunk/hadoop-yarn-project/hadoop-yarn/hadoop-yarn-client/target/surefire-reports
for the individual test results.
[ERROR] -> [Help 1]
[ERROR] 
[ERROR] To see the full stack trace of the errors, re-run Maven with the -e switch.
[ERROR] Re-run Maven using the -X switch to enable full debug logging.
[ERROR] 
[ERROR] For more information about the errors and possible solutions, please read the following
articles:
[ERROR] [Help 1] http://cwiki.apache.org/confluence/display/MAVEN/MojoFailureException
[ERROR] 
[ERROR] After correcting the problems, you can resume the build with the command
[ERROR]   mvn <goals> -rf :hadoop-yarn-client
Build step 'Execute shell' marked build as failure
Archiving artifacts
Updating YARN-1877
Updating HADOOP-10630
Updating HADOOP-10658
Updating HDFS-6424
Updating HDFS-6109
Updating YARN-1913
Updating YARN-1550
Updating YARN-2010
Sending e-mails to: yarn-dev@hadoop.apache.org
Email was triggered for: Failure
Sending email for trigger: Failure



###################################################################################
############################## FAILED TESTS (if any) ##############################
No tests ran.
Mime
  • Unnamed multipart/mixed (inline, None, 0 bytes)
View raw message