hadoop-yarn-dev mailing list archives

Site index · List index
Message view « Date » · « Thread »
Top « Date » · « Thread »
From Apache Jenkins Server <jenk...@builds.apache.org>
Subject Hadoop-Yarn-trunk - Build # 576 - Still Failing
Date Sat, 07 Jun 2014 11:20:08 GMT
See https://builds.apache.org/job/Hadoop-Yarn-trunk/576/

###################################################################################
########################## LAST 60 LINES OF THE CONSOLE ###########################
[...truncated 16174 lines...]

Tests run: 127, Failures: 1, Errors: 1, Skipped: 0

[INFO] ------------------------------------------------------------------------
[INFO] Reactor Summary:
[INFO] 
[INFO] hadoop-yarn ....................................... SUCCESS [5.261s]
[INFO] hadoop-yarn-api ................................... SUCCESS [3:22.722s]
[INFO] hadoop-yarn-common ................................ SUCCESS [2:22.862s]
[INFO] hadoop-yarn-server ................................ SUCCESS [0.131s]
[INFO] hadoop-yarn-server-common ......................... SUCCESS [36.754s]
[INFO] hadoop-yarn-server-nodemanager .................... SUCCESS [4:48.818s]
[INFO] hadoop-yarn-server-web-proxy ...................... SUCCESS [22.934s]
[INFO] hadoop-yarn-server-applicationhistoryservice ...... SUCCESS [1:27.870s]
[INFO] hadoop-yarn-server-resourcemanager ................ SUCCESS [21:11.735s]
[INFO] hadoop-yarn-server-tests .......................... SUCCESS [1:23.248s]
[INFO] hadoop-yarn-client ................................ FAILURE [8:14.725s]
[INFO] hadoop-yarn-applications .......................... SKIPPED
[INFO] hadoop-yarn-applications-distributedshell ......... SKIPPED
[INFO] hadoop-yarn-applications-unmanaged-am-launcher .... SKIPPED
[INFO] hadoop-yarn-site .................................. SKIPPED
[INFO] hadoop-yarn-project ............................... SKIPPED
[INFO] ------------------------------------------------------------------------
[INFO] BUILD FAILURE
[INFO] ------------------------------------------------------------------------
[INFO] Total time: 44:03.769s
[INFO] Finished at: Sat Jun 07 11:19:49 UTC 2014
[INFO] Final Memory: 54M/575M
[INFO] ------------------------------------------------------------------------
[ERROR] Failed to execute goal org.apache.maven.plugins:maven-surefire-plugin:2.16:test (default-test)
on project hadoop-yarn-client: There are test failures.
[ERROR] 
[ERROR] Please refer to /home/jenkins/jenkins-slave/workspace/Hadoop-Yarn-trunk/trunk/hadoop-yarn-project/hadoop-yarn/hadoop-yarn-client/target/surefire-reports
for the individual test results.
[ERROR] -> [Help 1]
[ERROR] 
[ERROR] To see the full stack trace of the errors, re-run Maven with the -e switch.
[ERROR] Re-run Maven using the -X switch to enable full debug logging.
[ERROR] 
[ERROR] For more information about the errors and possible solutions, please read the following
articles:
[ERROR] [Help 1] http://cwiki.apache.org/confluence/display/MAVEN/MojoFailureException
[ERROR] 
[ERROR] After correcting the problems, you can resume the build with the command
[ERROR]   mvn <goals> -rf :hadoop-yarn-client
Build step 'Execute shell' marked build as failure
Archiving artifacts
Updating MAPREDUCE-5898
Updating HADOOP-10647
Updating HDFS-6487
Updating HDFS-6497
Updating YARN-2132
Updating YARN-2121
Updating HDFS-6297
Updating YARN-2122
Updating YARN-2128
Updating YARN-2117
Updating MAPREDUCE-5777
Updating YARN-2118
Sending e-mails to: yarn-dev@hadoop.apache.org
Email was triggered for: Failure
Sending email for trigger: Failure



###################################################################################
############################## FAILED TESTS (if any) ##############################
No tests ran.
Mime
  • Unnamed multipart/mixed (inline, None, 0 bytes)
View raw message