hadoop-yarn-dev mailing list archives

Site index · List index
Message view « Date » · « Thread »
Top « Date » · « Thread »
From Apache Jenkins Server <jenk...@builds.apache.org>
Subject Hadoop-Yarn-trunk - Build # 597 - Still Failing
Date Sat, 28 Jun 2014 11:14:39 GMT
See https://builds.apache.org/job/Hadoop-Yarn-trunk/597/

###################################################################################
########################## LAST 60 LINES OF THE CONSOLE ###########################
[...truncated 15486 lines...]
Tests run: 40, Failures: 0, Errors: 0, Skipped: 0, Time elapsed: 173.062 sec - in org.apache.hadoop.yarn.server.resourcemanager.webapp.TestRMWebServicesApps

Results :

Failed tests: 
  TestRMApplicationHistoryWriter.testRMWritingMassiveHistory:391->testRMWritingMassiveHistory:430
expected:<10000> but was:<7208>

Tests run: 641, Failures: 1, Errors: 0, Skipped: 1

[INFO] ------------------------------------------------------------------------
[INFO] Reactor Summary:
[INFO] 
[INFO] hadoop-yarn ....................................... SUCCESS [5.581s]
[INFO] hadoop-yarn-api ................................... SUCCESS [3:28.696s]
[INFO] hadoop-yarn-common ................................ SUCCESS [2:25.549s]
[INFO] hadoop-yarn-server ................................ SUCCESS [0.127s]
[INFO] hadoop-yarn-server-common ......................... SUCCESS [38.011s]
[INFO] hadoop-yarn-server-nodemanager .................... SUCCESS [4:50.442s]
[INFO] hadoop-yarn-server-web-proxy ...................... SUCCESS [22.586s]
[INFO] hadoop-yarn-server-applicationhistoryservice ...... SUCCESS [1:28.407s]
[INFO] hadoop-yarn-server-resourcemanager ................ FAILURE [25:11.306s]
[INFO] hadoop-yarn-server-tests .......................... SKIPPED
[INFO] hadoop-yarn-client ................................ SKIPPED
[INFO] hadoop-yarn-applications .......................... SKIPPED
[INFO] hadoop-yarn-applications-distributedshell ......... SKIPPED
[INFO] hadoop-yarn-applications-unmanaged-am-launcher .... SKIPPED
[INFO] hadoop-yarn-site .................................. SKIPPED
[INFO] hadoop-yarn-project ............................... SKIPPED
[INFO] ------------------------------------------------------------------------
[INFO] BUILD FAILURE
[INFO] ------------------------------------------------------------------------
[INFO] Total time: 38:33.520s
[INFO] Finished at: Sat Jun 28 11:14:27 UTC 2014
[INFO] Final Memory: 51M/779M
[INFO] ------------------------------------------------------------------------
[ERROR] Failed to execute goal org.apache.maven.plugins:maven-surefire-plugin:2.16:test (default-test)
on project hadoop-yarn-server-resourcemanager: There are test failures.
[ERROR] 
[ERROR] Please refer to /home/jenkins/jenkins-slave/workspace/Hadoop-Yarn-trunk/trunk/hadoop-yarn-project/hadoop-yarn/hadoop-yarn-server/hadoop-yarn-server-resourcemanager/target/surefire-reports
for the individual test results.
[ERROR] -> [Help 1]
[ERROR] 
[ERROR] To see the full stack trace of the errors, re-run Maven with the -e switch.
[ERROR] Re-run Maven using the -X switch to enable full debug logging.
[ERROR] 
[ERROR] For more information about the errors and possible solutions, please read the following
articles:
[ERROR] [Help 1] http://cwiki.apache.org/confluence/display/MAVEN/MojoFailureException
[ERROR] 
[ERROR] After correcting the problems, you can resume the build with the command
[ERROR]   mvn <goals> -rf :hadoop-yarn-server-resourcemanager
Build step 'Execute shell' marked build as failure
Archiving artifacts
Updating HADOOP-10649
Updating YARN-2104
Updating HADOOP-10739
Updating YARN-2201
Updating HADOOP-10701
Updating YARN-2204
Sending e-mails to: yarn-dev@hadoop.apache.org
Email was triggered for: Failure
Sending email for trigger: Failure



###################################################################################
############################## FAILED TESTS (if any) ##############################
No tests ran.
Mime
  • Unnamed multipart/mixed (inline, None, 0 bytes)
View raw message