hadoop-yarn-dev mailing list archives

Site index · List index
Message view « Date » · « Thread »
Top « Date » · « Thread »
From Apache Jenkins Server <jenk...@builds.apache.org>
Subject Hadoop-Yarn-trunk - Build # 591 - Failure
Date Sun, 22 Jun 2014 11:28:58 GMT
See https://builds.apache.org/job/Hadoop-Yarn-trunk/591/

###################################################################################
########################## LAST 60 LINES OF THE CONSOLE ###########################
[...truncated 16542 lines...]
	at java.lang.Thread.sleep(Native Method)
	at org.apache.hadoop.yarn.applications.distributedshell.Client.monitorApplication(Client.java:670)
	at org.apache.hadoop.yarn.applications.distributedshell.Client.run(Client.java:651)
	at org.apache.hadoop.yarn.applications.distributedshell.TestDistributedShell.testDSShellWithCustomLogPropertyFile(TestDistributedShell.java:297)


Results :

Tests in error: 
  TestDistributedShell.testDSShellWithCustomLogPropertyFile:297 ยป  test timed ou...

Tests run: 8, Failures: 0, Errors: 1, Skipped: 0

[INFO] ------------------------------------------------------------------------
[INFO] Reactor Summary:
[INFO] 
[INFO] hadoop-yarn ....................................... SUCCESS [2.944s]
[INFO] hadoop-yarn-api ................................... SUCCESS [3:24.602s]
[INFO] hadoop-yarn-common ................................ SUCCESS [2:28.448s]
[INFO] hadoop-yarn-server ................................ SUCCESS [0.124s]
[INFO] hadoop-yarn-server-common ......................... SUCCESS [40.254s]
[INFO] hadoop-yarn-server-nodemanager .................... SUCCESS [4:48.986s]
[INFO] hadoop-yarn-server-web-proxy ...................... SUCCESS [23.986s]
[INFO] hadoop-yarn-server-applicationhistoryservice ...... SUCCESS [1:26.887s]
[INFO] hadoop-yarn-server-resourcemanager ................ SUCCESS [23:59.417s]
[INFO] hadoop-yarn-server-tests .......................... SUCCESS [1:23.078s]
[INFO] hadoop-yarn-client ................................ SUCCESS [8:38.618s]
[INFO] hadoop-yarn-applications .......................... SUCCESS [0.080s]
[INFO] hadoop-yarn-applications-distributedshell ......... FAILURE [5:05.926s]
[INFO] hadoop-yarn-applications-unmanaged-am-launcher .... SKIPPED
[INFO] hadoop-yarn-site .................................. SKIPPED
[INFO] hadoop-yarn-project ............................... SKIPPED
[INFO] ------------------------------------------------------------------------
[INFO] BUILD FAILURE
[INFO] ------------------------------------------------------------------------
[INFO] Total time: 52:25.514s
[INFO] Finished at: Sun Jun 22 11:28:52 UTC 2014
[INFO] Final Memory: 55M/627M
[INFO] ------------------------------------------------------------------------
[ERROR] Failed to execute goal org.apache.maven.plugins:maven-surefire-plugin:2.16:test (default-test)
on project hadoop-yarn-applications-distributedshell: There are test failures.
[ERROR] 
[ERROR] Please refer to /home/jenkins/jenkins-slave/workspace/Hadoop-Yarn-trunk/trunk/hadoop-yarn-project/hadoop-yarn/hadoop-yarn-applications/hadoop-yarn-applications-distributedshell/target/surefire-reports
for the individual test results.
[ERROR] -> [Help 1]
[ERROR] 
[ERROR] To see the full stack trace of the errors, re-run Maven with the -e switch.
[ERROR] Re-run Maven using the -X switch to enable full debug logging.
[ERROR] 
[ERROR] For more information about the errors and possible solutions, please read the following
articles:
[ERROR] [Help 1] http://cwiki.apache.org/confluence/display/MAVEN/MojoFailureException
[ERROR] 
[ERROR] After correcting the problems, you can resume the build with the command
[ERROR]   mvn <goals> -rf :hadoop-yarn-applications-distributedshell
Build step 'Execute shell' marked build as failure
Archiving artifacts
Updating HDFS-6583
Updating HDFS-4667
Sending e-mails to: yarn-dev@hadoop.apache.org
Email was triggered for: Failure
Sending email for trigger: Failure



###################################################################################
############################## FAILED TESTS (if any) ##############################
No tests ran.
Mime
  • Unnamed multipart/mixed (inline, None, 0 bytes)
View raw message