hadoop-yarn-dev mailing list archives

Site index · List index
Message view « Date » · « Thread »
Top « Date » · « Thread »
From Apache Jenkins Server <jenk...@builds.apache.org>
Subject Hadoop-Yarn-trunk - Build # 575 - Still Failing
Date Fri, 06 Jun 2014 11:20:58 GMT
See https://builds.apache.org/job/Hadoop-Yarn-trunk/575/

###################################################################################
########################## LAST 60 LINES OF THE CONSOLE ###########################
[...truncated 16160 lines...]


Results :

Failed tests: 
  TestRMAdminCLI.testHelp:307->testError:366 null

Tests in error: 
  TestRMAdminCLI.testTransitionToActive:180 ยป UnsupportedOperation

Tests run: 126, Failures: 1, Errors: 1, Skipped: 0

[INFO] ------------------------------------------------------------------------
[INFO] Reactor Summary:
[INFO] 
[INFO] hadoop-yarn ....................................... SUCCESS [8.308s]
[INFO] hadoop-yarn-api ................................... SUCCESS [3:23.254s]
[INFO] hadoop-yarn-common ................................ SUCCESS [2:19.906s]
[INFO] hadoop-yarn-server ................................ SUCCESS [0.080s]
[INFO] hadoop-yarn-server-common ......................... SUCCESS [37.135s]
[INFO] hadoop-yarn-server-nodemanager .................... SUCCESS [4:47.662s]
[INFO] hadoop-yarn-server-web-proxy ...................... SUCCESS [22.998s]
[INFO] hadoop-yarn-server-applicationhistoryservice ...... SUCCESS [1:27.205s]
[INFO] hadoop-yarn-server-resourcemanager ................ SUCCESS [21:09.928s]
[INFO] hadoop-yarn-server-tests .......................... SUCCESS [1:21.966s]
[INFO] hadoop-yarn-client ................................ FAILURE [8:15.705s]
[INFO] hadoop-yarn-applications .......................... SKIPPED
[INFO] hadoop-yarn-applications-distributedshell ......... SKIPPED
[INFO] hadoop-yarn-applications-unmanaged-am-launcher .... SKIPPED
[INFO] hadoop-yarn-site .................................. SKIPPED
[INFO] hadoop-yarn-project ............................... SKIPPED
[INFO] ------------------------------------------------------------------------
[INFO] BUILD FAILURE
[INFO] ------------------------------------------------------------------------
[INFO] Total time: 43:56.476s
[INFO] Finished at: Fri Jun 06 11:20:52 UTC 2014
[INFO] Final Memory: 60M/630M
[INFO] ------------------------------------------------------------------------
[ERROR] Failed to execute goal org.apache.maven.plugins:maven-surefire-plugin:2.16:test (default-test)
on project hadoop-yarn-client: There are test failures.
[ERROR] 
[ERROR] Please refer to /home/jenkins/jenkins-slave/workspace/Hadoop-Yarn-trunk/trunk/hadoop-yarn-project/hadoop-yarn/hadoop-yarn-client/target/surefire-reports
for the individual test results.
[ERROR] -> [Help 1]
[ERROR] 
[ERROR] To see the full stack trace of the errors, re-run Maven with the -e switch.
[ERROR] Re-run Maven using the -X switch to enable full debug logging.
[ERROR] 
[ERROR] For more information about the errors and possible solutions, please read the following
articles:
[ERROR] [Help 1] http://cwiki.apache.org/confluence/display/MAVEN/MojoFailureException
[ERROR] 
[ERROR] After correcting the problems, you can resume the build with the command
[ERROR]   mvn <goals> -rf :hadoop-yarn-client
Build step 'Execute shell' marked build as failure
Archiving artifacts
Updating HDFS-6369
Updating YARN-1977
Updating HDFS-6464
Sending e-mails to: yarn-dev@hadoop.apache.org
Email was triggered for: Failure
Sending email for trigger: Failure



###################################################################################
############################## FAILED TESTS (if any) ##############################
No tests ran.
Mime
  • Unnamed multipart/mixed (inline, None, 0 bytes)
View raw message