hadoop-yarn-dev mailing list archives

Site index · List index
Message view « Date » · « Thread »
Top « Date » · « Thread »
From Apache Jenkins Server <jenk...@builds.apache.org>
Subject Failed: YARN-1201 PreCommit Build #3677
Date Fri, 02 May 2014 05:38:11 GMT
Jira: https://issues.apache.org/jira/browse/YARN-1201
Build: https://builds.apache.org/job/PreCommit-YARN-Build/3677/

###################################################################################
########################## LAST 60 LINES OF THE CONSOLE ###########################
[...truncated 3025 lines...]
NOP




{color:red}-1 overall{color}.  Here are the results of testing the latest attachment 
  http://issues.apache.org/jira/secure/attachment/12642986/YARN-1201.patch
  against trunk revision .

    {color:green}+1 @author{color}.  The patch does not contain any @author tags.

    {color:green}+1 tests included{color}.  The patch appears to include 1 new or modified
test files.

    {color:green}+1 javac{color}.  The applied patch does not increase the total number of
javac compiler warnings.

    {color:green}+1 javadoc{color}.  There were no new javadoc warning messages.

    {color:green}+1 eclipse:eclipse{color}.  The patch built with eclipse:eclipse.

    {color:green}+1 findbugs{color}.  The patch does not introduce any new Findbugs (version
1.3.9) warnings.

    {color:green}+1 release audit{color}.  The applied patch does not increase the total number
of release audit warnings.

    {color:red}-1 core tests{color}.  The patch failed these unit tests in hadoop-yarn-project/hadoop-yarn/hadoop-yarn-server/hadoop-yarn-server-resourcemanager:

                  org.apache.hadoop.yarn.server.resourcemanager.TestAMAuthorization

    {color:green}+1 contrib tests{color}.  The patch passed contrib unit tests.

Test results: https://builds.apache.org/job/PreCommit-YARN-Build/3677//testReport/
Console output: https://builds.apache.org/job/PreCommit-YARN-Build/3677//console

This message is automatically generated.


======================================================================
======================================================================
    Adding comment to Jira.
======================================================================
======================================================================


Comment added.
4a82d6e5923a0661c2335a01309621b00f657236 logged out


======================================================================
======================================================================
    Finished build.
======================================================================
======================================================================


Build step 'Execute shell' marked build as failure
Archiving artifacts
[description-setter] Could not determine description.
Recording test results
Email was triggered for: Failure
Sending email for trigger: Failure



###################################################################################
############################## FAILED TESTS (if any) ##############################
1 tests failed.
FAILED:  org.apache.hadoop.yarn.server.resourcemanager.TestAMAuthorization.testUnauthorizedAccess[1]

Error Message:
Failed on local exception: java.io.IOException: org.apache.hadoop.security.AccessControlException:
Client cannot authenticate via:[TOKEN]; Host Details : local host is: "asf004.sp2.ygridcore.net/67.195.138.28";
destination host is: "asf004.sp2.ygridcore.net":8030; 

Stack Trace:
java.io.IOException: Failed on local exception: java.io.IOException: org.apache.hadoop.security.AccessControlException:
Client cannot authenticate via:[TOKEN]; Host Details : local host is: "asf004.sp2.ygridcore.net/67.195.138.28";
destination host is: "asf004.sp2.ygridcore.net":8030; 
	at org.apache.hadoop.security.SaslRpcClient.selectSaslClient(SaslRpcClient.java:172)
	at org.apache.hadoop.security.SaslRpcClient.saslConnect(SaslRpcClient.java:396)
	at org.apache.hadoop.ipc.Client$Connection.setupSaslConnection(Client.java:550)
	at org.apache.hadoop.ipc.Client$Connection.access$1800(Client.java:367)
	at org.apache.hadoop.ipc.Client$Connection$2.run(Client.java:716)
	at org.apache.hadoop.ipc.Client$Connection$2.run(Client.java:712)
	at java.security.AccessController.doPrivileged(Native Method)
	at javax.security.auth.Subject.doAs(Subject.java:396)
	at org.apache.hadoop.security.UserGroupInformation.doAs(UserGroupInformation.java:1606)
	at org.apache.hadoop.ipc.Client$Connection.setupIOstreams(Client.java:711)
	at org.apache.hadoop.ipc.Client$Connection.access$2800(Client.java:367)
	at org.apache.hadoop.ipc.Client.getConnection(Client.java:1462)
	at org.apache.hadoop.ipc.Client.call(Client.java:1381)
	at org.apache.hadoop.ipc.Client.call(Client.java:1363)
	at org.apache.hadoop.ipc.ProtobufRpcEngine$Invoker.invoke(ProtobufRpcEngine.java:206)
	at $Proxy16.registerApplicationMaster(Unknown Source)
	at org.apache.hadoop.yarn.api.impl.pb.client.ApplicationMasterProtocolPBClientImpl.registerApplicationMaster(ApplicationMasterProtocolPBClientImpl.java:106)
	at org.apache.hadoop.yarn.server.resourcemanager.TestAMAuthorization.testUnauthorizedAccess(TestAMAuthorization.java:273)



Mime
  • Unnamed multipart/mixed (inline, None, 0 bytes)
View raw message