hadoop-yarn-dev mailing list archives

Site index · List index
Message view « Date » · « Thread »
Top « Date » · « Thread »
From Apache Jenkins Server <jenk...@builds.apache.org>
Subject Hadoop-Yarn-trunk - Build # 569 - Still Failing
Date Sat, 31 May 2014 11:27:52 GMT
See https://builds.apache.org/job/Hadoop-Yarn-trunk/569/

###################################################################################
########################## LAST 60 LINES OF THE CONSOLE ###########################
[...truncated 16158 lines...]

Tests run: 126, Failures: 1, Errors: 1, Skipped: 0

[INFO] ------------------------------------------------------------------------
[INFO] Reactor Summary:
[INFO] 
[INFO] hadoop-yarn ....................................... SUCCESS [4.035s]
[INFO] hadoop-yarn-api ................................... SUCCESS [3:25.017s]
[INFO] hadoop-yarn-common ................................ SUCCESS [2:25.805s]
[INFO] hadoop-yarn-server ................................ SUCCESS [0.175s]
[INFO] hadoop-yarn-server-common ......................... SUCCESS [39.277s]
[INFO] hadoop-yarn-server-nodemanager .................... SUCCESS [4:48.283s]
[INFO] hadoop-yarn-server-web-proxy ...................... SUCCESS [22.581s]
[INFO] hadoop-yarn-server-applicationhistoryservice ...... SUCCESS [1:27.226s]
[INFO] hadoop-yarn-server-resourcemanager ................ SUCCESS [20:56.283s]
[INFO] hadoop-yarn-server-tests .......................... SUCCESS [1:23.133s]
[INFO] hadoop-yarn-client ................................ FAILURE [16:29.437s]
[INFO] hadoop-yarn-applications .......................... SKIPPED
[INFO] hadoop-yarn-applications-distributedshell ......... SKIPPED
[INFO] hadoop-yarn-applications-unmanaged-am-launcher .... SKIPPED
[INFO] hadoop-yarn-site .................................. SKIPPED
[INFO] hadoop-yarn-project ............................... SKIPPED
[INFO] ------------------------------------------------------------------------
[INFO] BUILD FAILURE
[INFO] ------------------------------------------------------------------------
[INFO] Total time: 52:03.740s
[INFO] Finished at: Sat May 31 11:27:42 UTC 2014
[INFO] Final Memory: 55M/590M
[INFO] ------------------------------------------------------------------------
[ERROR] Failed to execute goal org.apache.maven.plugins:maven-surefire-plugin:2.16:test (default-test)
on project hadoop-yarn-client: There are test failures.
[ERROR] 
[ERROR] Please refer to /home/jenkins/jenkins-slave/workspace/Hadoop-Yarn-trunk/trunk/hadoop-yarn-project/hadoop-yarn/hadoop-yarn-client/target/surefire-reports
for the individual test results.
[ERROR] -> [Help 1]
[ERROR] 
[ERROR] To see the full stack trace of the errors, re-run Maven with the -e switch.
[ERROR] Re-run Maven using the -X switch to enable full debug logging.
[ERROR] 
[ERROR] For more information about the errors and possible solutions, please read the following
articles:
[ERROR] [Help 1] http://cwiki.apache.org/confluence/display/MAVEN/MojoFailureException
[ERROR] 
[ERROR] After correcting the problems, you can resume the build with the command
[ERROR]   mvn <goals> -rf :hadoop-yarn-client
Build step 'Execute shell' marked build as failure
Archiving artifacts
Updating HDFS-6110
Updating YARN-1868
Updating HADOOP-10611
Updating YARN-2054
Updating HDFS-6472
Updating HADOOP-10645
Updating YARN-1338
Updating HDFS-6056
Updating HDFS-6375
Updating YARN-2010
Updating HDFS-6404
Updating YARN-2115
Sending e-mails to: yarn-dev@hadoop.apache.org
Email was triggered for: Failure
Sending email for trigger: Failure



###################################################################################
############################## FAILED TESTS (if any) ##############################
No tests ran.
Mime
  • Unnamed multipart/mixed (inline, None, 0 bytes)
View raw message