hadoop-yarn-dev mailing list archives

Site index · List index
Message view « Date » · « Thread »
Top « Date » · « Thread »
From Apache Jenkins Server <jenk...@builds.apache.org>
Subject Hadoop-Yarn-trunk - Build # 567 - Still Failing
Date Thu, 29 May 2014 11:22:07 GMT
See https://builds.apache.org/job/Hadoop-Yarn-trunk/567/

###################################################################################
########################## LAST 60 LINES OF THE CONSOLE ###########################
[...truncated 16096 lines...]
  TestRMAdminCLI.testHelp:307->testError:366 null

Tests in error: 
  TestRMAdminCLI.testTransitionToActive:180 ยป UnsupportedOperation

Tests run: 126, Failures: 1, Errors: 1, Skipped: 0

[INFO] ------------------------------------------------------------------------
[INFO] Reactor Summary:
[INFO] 
[INFO] hadoop-yarn ....................................... SUCCESS [3.287s]
[INFO] hadoop-yarn-api ................................... SUCCESS [3:27.216s]
[INFO] hadoop-yarn-common ................................ SUCCESS [2:24.401s]
[INFO] hadoop-yarn-server ................................ SUCCESS [0.093s]
[INFO] hadoop-yarn-server-common ......................... SUCCESS [40.005s]
[INFO] hadoop-yarn-server-nodemanager .................... SUCCESS [4:42.160s]
[INFO] hadoop-yarn-server-web-proxy ...................... SUCCESS [23.181s]
[INFO] hadoop-yarn-server-applicationhistoryservice ...... SUCCESS [1:24.919s]
[INFO] hadoop-yarn-server-resourcemanager ................ SUCCESS [20:55.131s]
[INFO] hadoop-yarn-server-tests .......................... SUCCESS [1:21.919s]
[INFO] hadoop-yarn-client ................................ FAILURE [8:15.514s]
[INFO] hadoop-yarn-applications .......................... SKIPPED
[INFO] hadoop-yarn-applications-distributedshell ......... SKIPPED
[INFO] hadoop-yarn-applications-unmanaged-am-launcher .... SKIPPED
[INFO] hadoop-yarn-site .................................. SKIPPED
[INFO] hadoop-yarn-project ............................... SKIPPED
[INFO] ------------------------------------------------------------------------
[INFO] BUILD FAILURE
[INFO] ------------------------------------------------------------------------
[INFO] Total time: 43:40.000s
[INFO] Finished at: Thu May 29 11:19:15 UTC 2014
[INFO] Final Memory: 61M/682M
[INFO] ------------------------------------------------------------------------
[ERROR] Failed to execute goal org.apache.maven.plugins:maven-surefire-plugin:2.16:test (default-test)
on project hadoop-yarn-client: There are test failures.
[ERROR] 
[ERROR] Please refer to /home/jenkins/jenkins-slave/workspace/Hadoop-Yarn-trunk/trunk/hadoop-yarn-project/hadoop-yarn/hadoop-yarn-client/target/surefire-reports
for the individual test results.
[ERROR] -> [Help 1]
[ERROR] 
[ERROR] To see the full stack trace of the errors, re-run Maven with the -e switch.
[ERROR] Re-run Maven using the -X switch to enable full debug logging.
[ERROR] 
[ERROR] For more information about the errors and possible solutions, please read the following
articles:
[ERROR] [Help 1] http://cwiki.apache.org/confluence/display/MAVEN/MojoFailureException
[ERROR] 
[ERROR] After correcting the problems, you can resume the build with the command
[ERROR]   mvn <goals> -rf :hadoop-yarn-client
Build step 'Execute shell' marked build as failure
Archiving artifacts
Updating YARN-2107
Updating MAPREDUCE-5895
Updating HDFS-6448
Updating YARN-596
Updating HDFS-6442
Updating HDFS-6453
Updating HADOOP-10625
Updating MAPREDUCE-5862
Sending e-mails to: yarn-dev@hadoop.apache.org
Email was triggered for: Failure
Sending email for trigger: Failure



###################################################################################
############################## FAILED TESTS (if any) ##############################
No tests ran.
Mime
  • Unnamed multipart/mixed (inline, None, 0 bytes)
View raw message