hadoop-yarn-dev mailing list archives

Site index · List index
Message view « Date » · « Thread »
Top « Date » · « Thread »
From Apache Jenkins Server <jenk...@builds.apache.org>
Subject Failed: YARN-1680 PreCommit Build #3834
Date Tue, 27 May 2014 17:29:15 GMT
Jira: https://issues.apache.org/jira/browse/YARN-1680
Build: https://builds.apache.org/job/PreCommit-YARN-Build/3834/

###################################################################################
########################## LAST 60 LINES OF THE CONSOLE ###########################
[...truncated 3003 lines...]
NOP




{color:red}-1 overall{color}.  Here are the results of testing the latest attachment 
  http://issues.apache.org/jira/secure/attachment/12646932/YARN-1680-v2.patch
  against trunk revision .

    {color:green}+1 @author{color}.  The patch does not contain any @author tags.

    {color:green}+1 tests included{color}.  The patch appears to include 2 new or modified
test files.

    {color:green}+1 javac{color}.  The applied patch does not increase the total number of
javac compiler warnings.

    {color:green}+1 javadoc{color}.  There were no new javadoc warning messages.

    {color:green}+1 eclipse:eclipse{color}.  The patch built with eclipse:eclipse.

    {color:green}+1 findbugs{color}.  The patch does not introduce any new Findbugs (version
1.3.9) warnings.

    {color:green}+1 release audit{color}.  The applied patch does not increase the total number
of release audit warnings.

    {color:red}-1 core tests{color}.  The patch failed these unit tests in hadoop-yarn-project/hadoop-yarn/hadoop-yarn-server/hadoop-yarn-server-resourcemanager:

                  org.apache.hadoop.yarn.server.resourcemanager.scheduler.fair.TestFairScheduler

    {color:green}+1 contrib tests{color}.  The patch passed contrib unit tests.

Test results: https://builds.apache.org/job/PreCommit-YARN-Build/3834//testReport/
Console output: https://builds.apache.org/job/PreCommit-YARN-Build/3834//console

This message is automatically generated.


======================================================================
======================================================================
    Adding comment to Jira.
======================================================================
======================================================================


Comment added.
15617ed973de6ac0d961f9634d3aed6cc0237e08 logged out


======================================================================
======================================================================
    Finished build.
======================================================================
======================================================================


Build step 'Execute shell' marked build as failure
Archiving artifacts
[description-setter] Could not determine description.
Recording test results
Email was triggered for: Failure
Sending email for trigger: Failure



###################################################################################
############################## FAILED TESTS (if any) ##############################
3 tests failed.
FAILED:  org.apache.hadoop.yarn.server.resourcemanager.scheduler.fair.TestFairScheduler.testQueuePlacementWithPolicy

Error Message:
null

Stack Trace:
java.lang.NullPointerException: null
	at org.apache.hadoop.yarn.server.resourcemanager.scheduler.fair.TestFairScheduler.testQueuePlacementWithPolicy(TestFairScheduler.java:624)


FAILED:  org.apache.hadoop.yarn.server.resourcemanager.scheduler.fair.TestFairScheduler.testNotUserAsDefaultQueue

Error Message:
null

Stack Trace:
java.lang.NullPointerException: null
	at org.apache.hadoop.yarn.server.resourcemanager.scheduler.fair.FairScheduler.addApplicationAttempt(FairScheduler.java:615)
	at org.apache.hadoop.yarn.server.resourcemanager.scheduler.fair.FairScheduler.handle(FairScheduler.java:1139)
	at org.apache.hadoop.yarn.server.resourcemanager.scheduler.fair.TestFairScheduler.testNotUserAsDefaultQueue(TestFairScheduler.java:530)


FAILED:  org.apache.hadoop.yarn.server.resourcemanager.scheduler.fair.TestFairScheduler.testDontAllowUndeclaredPools

Error Message:
expected:<1> but was:<0>

Stack Trace:
java.lang.AssertionError: expected:<1> but was:<0>
	at org.junit.Assert.fail(Assert.java:88)
	at org.junit.Assert.failNotEquals(Assert.java:743)
	at org.junit.Assert.assertEquals(Assert.java:118)
	at org.junit.Assert.assertEquals(Assert.java:555)
	at org.junit.Assert.assertEquals(Assert.java:542)
	at org.apache.hadoop.yarn.server.resourcemanager.scheduler.fair.TestFairScheduler.testDontAllowUndeclaredPools(TestFairScheduler.java:2412)



Mime
  • Unnamed multipart/mixed (inline, None, 0 bytes)
View raw message