hadoop-yarn-dev mailing list archives

Site index · List index
Message view « Date » · « Thread »
Top « Date » · « Thread »
From Apache Jenkins Server <jenk...@builds.apache.org>
Subject Failed: YARN-2049 PreCommit Build #3791
Date Fri, 23 May 2014 04:12:04 GMT
Jira: https://issues.apache.org/jira/browse/YARN-2049
Build: https://builds.apache.org/job/PreCommit-YARN-Build/3791/

###################################################################################
########################## LAST 60 LINES OF THE CONSOLE ###########################
[...truncated 3297 lines...]
NOP




{color:red}-1 overall{color}.  Here are the results of testing the latest attachment 
  http://issues.apache.org/jira/secure/attachment/12646431/YARN-2049.7.patch
  against trunk revision .

    {color:green}+1 @author{color}.  The patch does not contain any @author tags.

    {color:green}+1 tests included{color}.  The patch appears to include 3 new or modified
test files.

    {color:green}+1 javac{color}.  The applied patch does not increase the total number of
javac compiler warnings.

    {color:green}+1 javadoc{color}.  There were no new javadoc warning messages.

    {color:green}+1 eclipse:eclipse{color}.  The patch built with eclipse:eclipse.

    {color:green}+1 findbugs{color}.  The patch does not introduce any new Findbugs (version
1.3.9) warnings.

    {color:green}+1 release audit{color}.  The applied patch does not increase the total number
of release audit warnings.

    {color:red}-1 core tests{color}.  The patch failed these unit tests in hadoop-yarn-project/hadoop-yarn/hadoop-yarn-api
hadoop-yarn-project/hadoop-yarn/hadoop-yarn-client hadoop-yarn-project/hadoop-yarn/hadoop-yarn-common
hadoop-yarn-project/hadoop-yarn/hadoop-yarn-server/hadoop-yarn-server-applicationhistoryservice
hadoop-yarn-project/hadoop-yarn/hadoop-yarn-server/hadoop-yarn-server-tests:

                  org.apache.hadoop.yarn.client.TestRMAdminCLI

    {color:green}+1 contrib tests{color}.  The patch passed contrib unit tests.

Test results: https://builds.apache.org/job/PreCommit-YARN-Build/3791//testReport/
Console output: https://builds.apache.org/job/PreCommit-YARN-Build/3791//console

This message is automatically generated.


======================================================================
======================================================================
    Adding comment to Jira.
======================================================================
======================================================================


Comment added.
dd506adf21c946e2bb14532ae37509f640424a14 logged out


======================================================================
======================================================================
    Finished build.
======================================================================
======================================================================


Build step 'Execute shell' marked build as failure
Archiving artifacts
[description-setter] Could not determine description.
Recording test results
Email was triggered for: Failure
Sending email for trigger: Failure



###################################################################################
############################## FAILED TESTS (if any) ##############################
2 tests failed.
FAILED:  org.apache.hadoop.yarn.client.TestRMAdminCLI.testTransitionToActive

Error Message:
null

Stack Trace:
java.lang.UnsupportedOperationException: null
	at java.util.AbstractList.remove(AbstractList.java:144)
	at java.util.AbstractList$Itr.remove(AbstractList.java:360)
	at java.util.AbstractCollection.remove(AbstractCollection.java:252)
	at org.apache.hadoop.ha.HAAdmin.isOtherTargetNodeActive(HAAdmin.java:173)
	at org.apache.hadoop.ha.HAAdmin.transitionToActive(HAAdmin.java:144)
	at org.apache.hadoop.ha.HAAdmin.runCmd(HAAdmin.java:447)
	at org.apache.hadoop.ha.HAAdmin.run(HAAdmin.java:380)
	at org.apache.hadoop.yarn.client.cli.RMAdminCLI.run(RMAdminCLI.java:318)
	at org.apache.hadoop.yarn.client.TestRMAdminCLI.testTransitionToActive(TestRMAdminCLI.java:180)


FAILED:  org.apache.hadoop.yarn.client.TestRMAdminCLI.testHelp

Error Message:
null

Stack Trace:
java.lang.AssertionError: null
	at org.junit.Assert.fail(Assert.java:86)
	at org.junit.Assert.assertTrue(Assert.java:41)
	at org.junit.Assert.assertTrue(Assert.java:52)
	at org.apache.hadoop.yarn.client.TestRMAdminCLI.testError(TestRMAdminCLI.java:366)
	at org.apache.hadoop.yarn.client.TestRMAdminCLI.testHelp(TestRMAdminCLI.java:307)



Mime
  • Unnamed multipart/mixed (inline, None, 0 bytes)
View raw message