hadoop-yarn-dev mailing list archives

Site index · List index
Message view « Date » · « Thread »
Top « Date » · « Thread »
From Apache Jenkins Server <jenk...@builds.apache.org>
Subject Hadoop-Yarn-trunk - Build # 568 - Still Failing
Date Fri, 30 May 2014 11:20:27 GMT
See https://builds.apache.org/job/Hadoop-Yarn-trunk/568/

###################################################################################
########################## LAST 60 LINES OF THE CONSOLE ###########################
[...truncated 16101 lines...]
  TestRMAdminCLI.testTransitionToActive:180 ยป UnsupportedOperation

Tests run: 126, Failures: 1, Errors: 1, Skipped: 0

[INFO] ------------------------------------------------------------------------
[INFO] Reactor Summary:
[INFO] 
[INFO] hadoop-yarn ....................................... SUCCESS [3.271s]
[INFO] hadoop-yarn-api ................................... SUCCESS [3:24.112s]
[INFO] hadoop-yarn-common ................................ SUCCESS [2:23.892s]
[INFO] hadoop-yarn-server ................................ SUCCESS [0.079s]
[INFO] hadoop-yarn-server-common ......................... SUCCESS [39.122s]
[INFO] hadoop-yarn-server-nodemanager .................... SUCCESS [4:42.184s]
[INFO] hadoop-yarn-server-web-proxy ...................... SUCCESS [23.174s]
[INFO] hadoop-yarn-server-applicationhistoryservice ...... SUCCESS [1:27.228s]
[INFO] hadoop-yarn-server-resourcemanager ................ SUCCESS [20:50.740s]
[INFO] hadoop-yarn-server-tests .......................... SUCCESS [1:23.090s]
[INFO] hadoop-yarn-client ................................ FAILURE [8:18.278s]
[INFO] hadoop-yarn-applications .......................... SKIPPED
[INFO] hadoop-yarn-applications-distributedshell ......... SKIPPED
[INFO] hadoop-yarn-applications-unmanaged-am-launcher .... SKIPPED
[INFO] hadoop-yarn-site .................................. SKIPPED
[INFO] hadoop-yarn-project ............................... SKIPPED
[INFO] ------------------------------------------------------------------------
[INFO] BUILD FAILURE
[INFO] ------------------------------------------------------------------------
[INFO] Total time: 43:37.411s
[INFO] Finished at: Fri May 30 11:20:07 UTC 2014
[INFO] Final Memory: 55M/564M
[INFO] ------------------------------------------------------------------------
[ERROR] Failed to execute goal org.apache.maven.plugins:maven-surefire-plugin:2.16:test (default-test)
on project hadoop-yarn-client: There are test failures.
[ERROR] 
[ERROR] Please refer to /home/jenkins/jenkins-slave/workspace/Hadoop-Yarn-trunk/trunk/hadoop-yarn-project/hadoop-yarn/hadoop-yarn-client/target/surefire-reports
for the individual test results.
[ERROR] -> [Help 1]
[ERROR] 
[ERROR] To see the full stack trace of the errors, re-run Maven with the -e switch.
[ERROR] Re-run Maven using the -X switch to enable full debug logging.
[ERROR] 
[ERROR] For more information about the errors and possible solutions, please read the following
articles:
[ERROR] [Help 1] http://cwiki.apache.org/confluence/display/MAVEN/MojoFailureException
[ERROR] 
[ERROR] After correcting the problems, you can resume the build with the command
[ERROR]   mvn <goals> -rf :hadoop-yarn-client
Build step 'Execute shell' marked build as failure
Archiving artifacts
Updating HDFS-6356
Updating HDFS-6447
Updating HDFS-6462
Updating YARN-2112
Updating HDFS-6463
Updating HADOOP-10448
Updating HDFS-6461
Updating HADOOP-10639
Updating HADOOP-9968
Updating HADOOP-10638
Updating HADOOP-10602
Sending e-mails to: yarn-dev@hadoop.apache.org
Email was triggered for: Failure
Sending email for trigger: Failure



###################################################################################
############################## FAILED TESTS (if any) ##############################
No tests ran.
Mime
  • Unnamed multipart/mixed (inline, None, 0 bytes)
View raw message