hadoop-yarn-dev mailing list archives

Site index · List index
Message view « Date » · « Thread »
Top « Date » · « Thread »
From Apache Jenkins Server <jenk...@builds.apache.org>
Subject Hadoop-Yarn-trunk - Build # 535 - Failure
Date Thu, 10 Apr 2014 11:39:05 GMT
See https://builds.apache.org/job/Hadoop-Yarn-trunk/535/

###################################################################################
########################## LAST 60 LINES OF THE CONSOLE ###########################
[...truncated 14729 lines...]
Tests run: 15, Failures: 0, Errors: 0, Skipped: 0, Time elapsed: 6.551 sec - in org.apache.hadoop.yarn.server.applicationhistoryservice.webapp.TestTimelineWebServices
Running org.apache.hadoop.yarn.server.applicationhistoryservice.webapp.TestAHSWebApp
Tests run: 5, Failures: 0, Errors: 0, Skipped: 0, Time elapsed: 4.361 sec - in org.apache.hadoop.yarn.server.applicationhistoryservice.webapp.TestAHSWebApp
Running org.apache.hadoop.yarn.server.applicationhistoryservice.webapp.TestAHSWebServices
Tests run: 9, Failures: 0, Errors: 0, Skipped: 0, Time elapsed: 5.486 sec - in org.apache.hadoop.yarn.server.applicationhistoryservice.webapp.TestAHSWebServices

Results :

Tests run: 68, Failures: 0, Errors: 0, Skipped: 0

[INFO] 
[INFO] --- maven-jar-plugin:2.3.1:jar (default-jar) @ hadoop-yarn-server-applicationhistoryservice
---
[INFO] Building jar: /home/jenkins/jenkins-slave/workspace/Hadoop-Yarn-trunk/trunk/hadoop-yarn-project/hadoop-yarn/hadoop-yarn-server/hadoop-yarn-server-applicationhistoryservice/target/hadoop-yarn-server-applicationhistoryservice-3.0.0-SNAPSHOT.jar
[INFO] 
[INFO] --- maven-source-plugin:2.1.2:jar-no-fork (hadoop-java-sources) @ hadoop-yarn-server-applicationhistoryservice
---
[INFO] Building jar: /home/jenkins/jenkins-slave/workspace/Hadoop-Yarn-trunk/trunk/hadoop-yarn-project/hadoop-yarn/hadoop-yarn-server/hadoop-yarn-server-applicationhistoryservice/target/hadoop-yarn-server-applicationhistoryservice-3.0.0-SNAPSHOT-sources.jar
[INFO] 
[INFO] --- maven-source-plugin:2.1.2:test-jar-no-fork (hadoop-java-sources) @ hadoop-yarn-server-applicationhistoryservice
---
[INFO] Building jar: /home/jenkins/jenkins-slave/workspace/Hadoop-Yarn-trunk/trunk/hadoop-yarn-project/hadoop-yarn/hadoop-yarn-server/hadoop-yarn-server-applicationhistoryservice/target/hadoop-yarn-server-applicationhistoryservice-3.0.0-SNAPSHOT-test-sources.jar
[INFO] 
[INFO] --- maven-enforcer-plugin:1.3.1:enforce (dist-enforce) @ hadoop-yarn-server-applicationhistoryservice
---
[INFO] 
[INFO] --- maven-site-plugin:3.3:attach-descriptor (attach-descriptor) @ hadoop-yarn-server-applicationhistoryservice
---
[INFO] 
[INFO] --- maven-javadoc-plugin:2.8.1:jar (module-javadocs) @ hadoop-yarn-server-applicationhistoryservice
---
FATAL: hudson.remoting.RequestAbortedException: java.io.IOException: Unexpected termination
of the channel
hudson.remoting.RequestAbortedException: hudson.remoting.RequestAbortedException: java.io.IOException:
Unexpected termination of the channel
	at hudson.remoting.RequestAbortedException.wrapForRethrow(RequestAbortedException.java:41)
	at hudson.remoting.RequestAbortedException.wrapForRethrow(RequestAbortedException.java:34)
	at hudson.remoting.Request.call(Request.java:174)
	at hudson.remoting.Channel.call(Channel.java:722)
	at hudson.remoting.RemoteInvocationHandler.invoke(RemoteInvocationHandler.java:167)
	at com.sun.proxy.$Proxy51.join(Unknown Source)
	at hudson.Launcher$RemoteLauncher$ProcImpl.join(Launcher.java:925)
	at hudson.tasks.CommandInterpreter.join(CommandInterpreter.java:137)
	at hudson.tasks.CommandInterpreter.perform(CommandInterpreter.java:97)
	at hudson.tasks.CommandInterpreter.perform(CommandInterpreter.java:66)
	at hudson.tasks.BuildStepMonitor$1.perform(BuildStepMonitor.java:20)
	at hudson.model.AbstractBuild$AbstractBuildExecution.perform(AbstractBuild.java:744)
	at hudson.model.Build$BuildExecution.build(Build.java:198)
	at hudson.model.Build$BuildExecution.doRun(Build.java:159)
	at hudson.model.AbstractBuild$AbstractBuildExecution.run(AbstractBuild.java:523)
	at hudson.model.Run.execute(Run.java:1700)
	at hudson.model.FreeStyleBuild.run(FreeStyleBuild.java:43)
	at hudson.model.ResourceController.execute(ResourceController.java:88)
	at hudson.model.Executor.run(Executor.java:231)
Caused by: hudson.remoting.RequestAbortedException: java.io.IOException: Unexpected termination
of the channel
	at hudson.remoting.Request.abort(Request.java:299)
	at hudson.remoting.Channel.terminate(Channel.java:782)
	at hudson.remoting.SynchronousCommandTransport$ReaderThread.run(SynchronousCommandTransport.java:69)
Caused by: java.io.IOException: Unexpected termination of the channel
	at hudson.remoting.SynchronousCommandTransport$ReaderThread.run(SynchronousCommandTransport.java:50)
Caused by: java.io.EOFException
	at java.io.ObjectInputStream$BlockDataInputStream.peekByte(ObjectInputStream.java:2601)
	at java.io.ObjectInputStream.readObject0(ObjectInputStream.java:1319)
	at java.io.ObjectInputStream.readObject(ObjectInputStream.java:371)
	at hudson.remoting.Command.readFrom(Command.java:92)
	at hudson.remoting.ClassicCommandTransport.read(ClassicCommandTransport.java:71)
	at hudson.remoting.SynchronousCommandTransport$ReaderThread.run(SynchronousCommandTransport.java:48)



###################################################################################
############################## FAILED TESTS (if any) ##############################
No tests ran.
Mime
  • Unnamed multipart/mixed (inline, None, 0 bytes)
View raw message