hadoop-yarn-dev mailing list archives

Site index · List index
Message view « Date » · « Thread »
Top « Date » · « Thread »
From Apache Jenkins Server <jenk...@builds.apache.org>
Subject Hadoop-Yarn-trunk - Build # 533 - Failure
Date Tue, 08 Apr 2014 11:08:20 GMT
See https://builds.apache.org/job/Hadoop-Yarn-trunk/533/

###################################################################################
########################## LAST 60 LINES OF THE CONSOLE ###########################
[...truncated 15148 lines...]
Results :

Failed tests: 
  TestRMRestart.testQueueMetricsOnRMRestart:1687->assertQueueMetrics:1731 expected:<3>
but was:<4>

Tests run: 589, Failures: 1, Errors: 0, Skipped: 1

[INFO] ------------------------------------------------------------------------
[INFO] Reactor Summary:
[INFO] 
[INFO] hadoop-yarn ....................................... SUCCESS [3.956s]
[INFO] hadoop-yarn-api ................................... SUCCESS [3:22.641s]
[INFO] hadoop-yarn-common ................................ SUCCESS [2:19.124s]
[INFO] hadoop-yarn-server ................................ SUCCESS [0.078s]
[INFO] hadoop-yarn-server-common ......................... SUCCESS [32.804s]
[INFO] hadoop-yarn-server-nodemanager .................... SUCCESS [4:40.979s]
[INFO] hadoop-yarn-server-web-proxy ...................... SUCCESS [18.990s]
[INFO] hadoop-yarn-server-applicationhistoryservice ...... SUCCESS [1:17.998s]
[INFO] hadoop-yarn-server-resourcemanager ................ FAILURE [19:40.891s]
[INFO] hadoop-yarn-server-tests .......................... SKIPPED
[INFO] hadoop-yarn-client ................................ SKIPPED
[INFO] hadoop-yarn-applications .......................... SKIPPED
[INFO] hadoop-yarn-applications-distributedshell ......... SKIPPED
[INFO] hadoop-yarn-applications-unmanaged-am-launcher .... SKIPPED
[INFO] hadoop-yarn-site .................................. SKIPPED
[INFO] hadoop-yarn-project ............................... SKIPPED
[INFO] ------------------------------------------------------------------------
[INFO] BUILD FAILURE
[INFO] ------------------------------------------------------------------------
[INFO] Total time: 32:19.918s
[INFO] Finished at: Tue Apr 08 11:07:47 UTC 2014
[INFO] Final Memory: 46M/653M
[INFO] ------------------------------------------------------------------------
[ERROR] Failed to execute goal org.apache.maven.plugins:maven-surefire-plugin:2.16:test (default-test)
on project hadoop-yarn-server-resourcemanager: There are test failures.
[ERROR] 
[ERROR] Please refer to /home/jenkins/jenkins-slave/workspace/Hadoop-Yarn-trunk/trunk/hadoop-yarn-project/hadoop-yarn/hadoop-yarn-server/hadoop-yarn-server-resourcemanager/target/surefire-reports
for the individual test results.
[ERROR] -> [Help 1]
[ERROR] 
[ERROR] To see the full stack trace of the errors, re-run Maven with the -e switch.
[ERROR] Re-run Maven using the -X switch to enable full debug logging.
[ERROR] 
[ERROR] For more information about the errors and possible solutions, please read the following
articles:
[ERROR] [Help 1] http://cwiki.apache.org/confluence/display/MAVEN/MojoFailureException
[ERROR] 
[ERROR] After correcting the problems, you can resume the build with the command
[ERROR]   mvn <goals> -rf :hadoop-yarn-server-resourcemanager
Build step 'Execute shell' marked build as failure
Archiving artifacts
Updating HDFS-6181
Updating HADOOP-10468
Updating HDFS-6197
Updating HDFS-6143
Updating HDFS-6198
Updating HADOOP-10466
Updating HDFS-6180
Updating HDFS-6191
Sending e-mails to: yarn-dev@hadoop.apache.org
Email was triggered for: Failure
Sending email for trigger: Failure



###################################################################################
############################## FAILED TESTS (if any) ##############################
No tests ran.
Mime
  • Unnamed multipart/mixed (inline, None, 0 bytes)
View raw message