hadoop-yarn-dev mailing list archives

Site index · List index
Message view « Date » · « Thread »
Top « Date » · « Thread »
From Apache Jenkins Server <jenk...@builds.apache.org>
Subject Hadoop-Yarn-trunk - Build # 523 - Failure
Date Fri, 28 Mar 2014 11:51:21 GMT
See https://builds.apache.org/job/Hadoop-Yarn-trunk/523/

###################################################################################
########################## LAST 60 LINES OF THE CONSOLE ###########################
[...truncated 16025 lines...]

Running org.apache.hadoop.yarn.client.TestRMAdminCLI
Tests run: 13, Failures: 0, Errors: 0, Skipped: 0, Time elapsed: 1.278 sec - in org.apache.hadoop.yarn.client.TestRMAdminCLI

Results :

Tests in error: 
  TestResourceTrackerOnHA.testResourceTrackerOnHA:74 ยป YarnRuntime java.lang.Int...

Tests run: 123, Failures: 0, Errors: 1, Skipped: 0

[INFO] ------------------------------------------------------------------------
[INFO] Reactor Summary:
[INFO] 
[INFO] hadoop-yarn ....................................... SUCCESS [2.764s]
[INFO] hadoop-yarn-api ................................... SUCCESS [3:12.636s]
[INFO] hadoop-yarn-common ................................ SUCCESS [2:09.329s]
[INFO] hadoop-yarn-server ................................ SUCCESS [0.070s]
[INFO] hadoop-yarn-server-common ......................... SUCCESS [33.476s]
[INFO] hadoop-yarn-server-nodemanager .................... SUCCESS [4:27.826s]
[INFO] hadoop-yarn-server-web-proxy ...................... SUCCESS [20.579s]
[INFO] hadoop-yarn-server-applicationhistoryservice ...... SUCCESS [1:18.814s]
[INFO] hadoop-yarn-server-resourcemanager ................ SUCCESS [20:15.127s]
[INFO] hadoop-yarn-server-tests .......................... SUCCESS [1:20.291s]
[INFO] hadoop-yarn-client ................................ FAILURE [6:33.461s]
[INFO] hadoop-yarn-applications .......................... SKIPPED
[INFO] hadoop-yarn-applications-distributedshell ......... SKIPPED
[INFO] hadoop-yarn-applications-unmanaged-am-launcher .... SKIPPED
[INFO] hadoop-yarn-site .................................. SKIPPED
[INFO] hadoop-yarn-project ............................... SKIPPED
[INFO] ------------------------------------------------------------------------
[INFO] BUILD FAILURE
[INFO] ------------------------------------------------------------------------
[INFO] Total time: 40:16.385s
[INFO] Finished at: Fri Mar 28 11:45:33 UTC 2014
[INFO] Final Memory: 61M/793M
[INFO] ------------------------------------------------------------------------
[ERROR] Failed to execute goal org.apache.maven.plugins:maven-surefire-plugin:2.16:test (default-test)
on project hadoop-yarn-client: There are test failures.
[ERROR] 
[ERROR] Please refer to /home/jenkins/jenkins-slave/workspace/Hadoop-Yarn-trunk/trunk/hadoop-yarn-project/hadoop-yarn/hadoop-yarn-client/target/surefire-reports
for the individual test results.
[ERROR] -> [Help 1]
[ERROR] 
[ERROR] To see the full stack trace of the errors, re-run Maven with the -e switch.
[ERROR] Re-run Maven using the -X switch to enable full debug logging.
[ERROR] 
[ERROR] For more information about the errors and possible solutions, please read the following
articles:
[ERROR] [Help 1] http://cwiki.apache.org/confluence/display/MAVEN/MojoFailureException
[ERROR] 
[ERROR] After correcting the problems, you can resume the build with the command
[ERROR]   mvn <goals> -rf :hadoop-yarn-client
Build step 'Execute shell' marked build as failure
Archiving artifacts
Updating HADOOP-10442
Updating HDFS-5978
Updating HDFS-6163
Updating HDFS-6164
Sending e-mails to: yarn-dev@hadoop.apache.org
Email was triggered for: Failure
Sending email for trigger: Failure



###################################################################################
############################## FAILED TESTS (if any) ##############################
No tests ran.
Mime
  • Unnamed multipart/mixed (inline, None, 0 bytes)
View raw message