hadoop-yarn-dev mailing list archives

Site index · List index
Message view « Date » · « Thread »
Top « Date » · « Thread »
From Apache Jenkins Server <jenk...@builds.apache.org>
Subject Failed: YARN-1106 PreCommit Build #3476
Date Thu, 27 Mar 2014 23:15:29 GMT
Jira: https://issues.apache.org/jira/browse/YARN-1106
Build: https://builds.apache.org/job/PreCommit-YARN-Build/3476/

###################################################################################
########################## LAST 60 LINES OF THE CONSOLE ###########################
[...truncated 3070 lines...]



{color:red}-1 overall{color}.  Here are the results of testing the latest attachment 
  http://issues.apache.org/jira/secure/attachment/12637253/YARN-1106.patch
  against trunk revision .

    {color:green}+1 @author{color}.  The patch does not contain any @author tags.

    {color:green}+1 tests included{color}.  The patch appears to include 1 new or modified
test files.

    {color:green}+1 javac{color}.  The applied patch does not increase the total number of
javac compiler warnings.

    {color:green}+1 javadoc{color}.  There were no new javadoc warning messages.

    {color:green}+1 eclipse:eclipse{color}.  The patch built with eclipse:eclipse.

    {color:green}+1 findbugs{color}.  The patch does not introduce any new Findbugs (version
1.3.9) warnings.

    {color:green}+1 release audit{color}.  The applied patch does not increase the total number
of release audit warnings.

    {color:red}-1 core tests{color}.  The patch failed these unit tests in hadoop-yarn-project/hadoop-yarn/hadoop-yarn-server/hadoop-yarn-server-resourcemanager:

                  org.apache.hadoop.yarn.server.resourcemanager.rmapp.TestRMAppTransitions
                  org.apache.hadoop.yarn.server.resourcemanager.rmapp.attempt.TestRMAppAttemptTransitions

    {color:green}+1 contrib tests{color}.  The patch passed contrib unit tests.

Test results: https://builds.apache.org/job/PreCommit-YARN-Build/3476//testReport/
Console output: https://builds.apache.org/job/PreCommit-YARN-Build/3476//console

This message is automatically generated.


======================================================================
======================================================================
    Adding comment to Jira.
======================================================================
======================================================================


Comment added.
9bf263b6b12b6eb138857cfc6ac16adca59d0475 logged out


======================================================================
======================================================================
    Finished build.
======================================================================
======================================================================


Build step 'Execute shell' marked build as failure
Archiving artifacts
[description-setter] Could not determine description.
Recording test results
Publish JUnit test result report is waiting for a checkpoint on PreCommit-YARN-Build #3475
Email was triggered for: Failure
Sending email for trigger: Failure



###################################################################################
############################## FAILED TESTS (if any) ##############################
3 tests failed.
REGRESSION:  org.apache.hadoop.yarn.server.resourcemanager.rmapp.TestRMAppTransitions.testAppKilledKilled[1]

Error Message:
application finish time is not greater then 0

Stack Trace:
java.lang.AssertionError: application finish time is not greater then 0
	at org.junit.Assert.fail(Assert.java:93)
	at org.junit.Assert.assertTrue(Assert.java:43)
	at org.apache.hadoop.yarn.server.resourcemanager.rmapp.TestRMAppTransitions.assertTimesAtFinish(TestRMAppTransitions.java:296)
	at org.apache.hadoop.yarn.server.resourcemanager.rmapp.TestRMAppTransitions.testAppKilledKilled(TestRMAppTransitions.java:835)


FAILED:  org.apache.hadoop.yarn.server.resourcemanager.rmapp.attempt.TestRMAppAttemptTransitions.testNoTrackingUrlSetRMAppPageComplete[0]

Error Message:
expected:<[asf007.sp2.ygridcore.net:8088/cluster/app/application_1395959866229_0031]>
but was:<[N/A]>

Stack Trace:
org.junit.ComparisonFailure: expected:<[asf007.sp2.ygridcore.net:8088/cluster/app/application_1395959866229_0031]>
but was:<[N/A]>
	at org.junit.Assert.assertEquals(Assert.java:125)
	at org.junit.Assert.assertEquals(Assert.java:147)
	at org.apache.hadoop.yarn.server.resourcemanager.rmapp.attempt.TestRMAppAttemptTransitions.testNoTrackingUrlSetRMAppPageComplete(TestRMAppAttemptTransitions.java:1252)


FAILED:  org.apache.hadoop.yarn.server.resourcemanager.rmapp.attempt.TestRMAppAttemptTransitions.testNoTrackingUrlSetRMAppPageComplete[1]

Error Message:
expected:<[asf007.sp2.ygridcore.net:8088/cluster/app/application_1395959866229_0062]>
but was:<[N/A]>

Stack Trace:
org.junit.ComparisonFailure: expected:<[asf007.sp2.ygridcore.net:8088/cluster/app/application_1395959866229_0062]>
but was:<[N/A]>
	at org.junit.Assert.assertEquals(Assert.java:125)
	at org.junit.Assert.assertEquals(Assert.java:147)
	at org.apache.hadoop.yarn.server.resourcemanager.rmapp.attempt.TestRMAppAttemptTransitions.testNoTrackingUrlSetRMAppPageComplete(TestRMAppAttemptTransitions.java:1252)



Mime
  • Unnamed multipart/mixed (inline, None, 0 bytes)
View raw message