hadoop-yarn-dev mailing list archives

Site index · List index
Message view « Date » · « Thread »
Top « Date » · « Thread »
From Apache Jenkins Server <jenk...@builds.apache.org>
Subject Hadoop-Yarn-trunk - Build # 514 - Still Failing
Date Wed, 19 Mar 2014 11:17:33 GMT
See https://builds.apache.org/job/Hadoop-Yarn-trunk/514/

###################################################################################
########################## LAST 60 LINES OF THE CONSOLE ###########################
[...truncated 15982 lines...]

Results :

Tests in error: 
  TestRMFailover.testRMWebAppRedirect:269 NullPointer

Tests run: 104, Failures: 0, Errors: 1, Skipped: 0

[INFO] ------------------------------------------------------------------------
[INFO] Reactor Summary:
[INFO] 
[INFO] hadoop-yarn ....................................... SUCCESS [3.085s]
[INFO] hadoop-yarn-api ................................... SUCCESS [3:30.582s]
[INFO] hadoop-yarn-common ................................ SUCCESS [2:24.085s]
[INFO] hadoop-yarn-server ................................ SUCCESS [0.077s]
[INFO] hadoop-yarn-server-common ......................... SUCCESS [34.971s]
[INFO] hadoop-yarn-server-nodemanager .................... SUCCESS [4:44.350s]
[INFO] hadoop-yarn-server-web-proxy ...................... SUCCESS [21.051s]
[INFO] hadoop-yarn-server-applicationhistoryservice ...... SUCCESS [1:26.882s]
[INFO] hadoop-yarn-server-resourcemanager ................ SUCCESS [20:58.962s]
[INFO] hadoop-yarn-server-tests .......................... SUCCESS [1:27.094s]
[INFO] hadoop-yarn-client ................................ FAILURE [4:57.215s]
[INFO] hadoop-yarn-applications .......................... SKIPPED
[INFO] hadoop-yarn-applications-distributedshell ......... SKIPPED
[INFO] hadoop-yarn-applications-unmanaged-am-launcher .... SKIPPED
[INFO] hadoop-yarn-site .................................. SKIPPED
[INFO] hadoop-yarn-project ............................... SKIPPED
[INFO] ------------------------------------------------------------------------
[INFO] BUILD FAILURE
[INFO] ------------------------------------------------------------------------
[INFO] Total time: 40:30.876s
[INFO] Finished at: Wed Mar 19 11:17:28 UTC 2014
[INFO] Final Memory: 60M/769M
[INFO] ------------------------------------------------------------------------
[ERROR] Failed to execute goal org.apache.maven.plugins:maven-surefire-plugin:2.16:test (default-test)
on project hadoop-yarn-client: There are test failures.
[ERROR] 
[ERROR] Please refer to /home/jenkins/jenkins-slave/workspace/Hadoop-Yarn-trunk/trunk/hadoop-yarn-project/hadoop-yarn/hadoop-yarn-client/target/surefire-reports
for the individual test results.
[ERROR] -> [Help 1]
[ERROR] 
[ERROR] To see the full stack trace of the errors, re-run Maven with the -e switch.
[ERROR] Re-run Maven using the -X switch to enable full debug logging.
[ERROR] 
[ERROR] For more information about the errors and possible solutions, please read the following
articles:
[ERROR] [Help 1] http://cwiki.apache.org/confluence/display/MAVEN/MojoFailureException
[ERROR] 
[ERROR] After correcting the problems, you can resume the build with the command
[ERROR]   mvn <goals> -rf :hadoop-yarn-client
Build step 'Execute shell' marked build as failure
Archiving artifacts
Updating HDFS-6068
Updating HDFS-6007
Updating HDFS-6117
Updating YARN-1705
Updating YARN-1690
Updating HDFS-6112
Updating HDFS-6099
Sending e-mails to: yarn-dev@hadoop.apache.org
Email was triggered for: Failure
Sending email for trigger: Failure



###################################################################################
############################## FAILED TESTS (if any) ##############################
No tests ran.
Mime
  • Unnamed multipart/mixed (inline, None, 0 bytes)
View raw message