hadoop-yarn-dev mailing list archives

Site index · List index
Message view « Date » · « Thread »
Top « Date » · « Thread »
From Apache Jenkins Server <jenk...@builds.apache.org>
Subject Failed: YARN-1553 PreCommit Build #2992
Date Mon, 03 Feb 2014 22:07:36 GMT
Jira: https://issues.apache.org/jira/browse/YARN-1553
Build: https://builds.apache.org/job/PreCommit-YARN-Build/2992/

###################################################################################
########################## LAST 60 LINES OF THE CONSOLE ###########################
[...truncated 5906 lines...]
{color:red}-1 overall{color}.  Here are the results of testing the latest attachment 
  http://issues.apache.org/jira/secure/attachment/12626713/YARN-1553.002.patch
  against trunk revision .

    {color:green}+1 @author{color}.  The patch does not contain any @author tags.

    {color:green}+1 tests included{color}.  The patch appears to include 6 new or modified
test files.

    {color:green}+1 javac{color}.  The applied patch does not increase the total number of
javac compiler warnings.

    {color:green}+1 javadoc{color}.  The javadoc tool did not generate any warning messages.

    {color:green}+1 eclipse:eclipse{color}.  The patch built with eclipse:eclipse.

    {color:red}-1 findbugs{color}.  The patch appears to introduce 1 new Findbugs (version
1.3.9) warnings.

    {color:green}+1 release audit{color}.  The applied patch does not increase the total number
of release audit warnings.

    {color:red}-1 core tests{color}.  The patch failed these unit tests in hadoop-common-project/hadoop-common
hadoop-mapreduce-project/hadoop-mapreduce-client/hadoop-mapreduce-client-app hadoop-mapreduce-project/hadoop-mapreduce-client/hadoop-mapreduce-client-common
hadoop-mapreduce-project/hadoop-mapreduce-client/hadoop-mapreduce-client-core hadoop-mapreduce-project/hadoop-mapreduce-client/hadoop-mapreduce-client-hs
hadoop-mapreduce-project/hadoop-mapreduce-client/hadoop-mapreduce-client-jobclient hadoop-yarn-project/hadoop-yarn/hadoop-yarn-api
hadoop-yarn-project/hadoop-yarn/hadoop-yarn-common hadoop-yarn-project/hadoop-yarn/hadoop-yarn-server/hadoop-yarn-server-common
hadoop-yarn-project/hadoop-yarn/hadoop-yarn-server/hadoop-yarn-server-nodemanager hadoop-yarn-project/hadoop-yarn/hadoop-yarn-server/hadoop-yarn-server-resourcemanager
hadoop-yarn-project/hadoop-yarn/hadoop-yarn-server/hadoop-yarn-server-tests hadoop-yarn-project/hadoop-yarn/hadoop-yarn-server/hadoop-yarn-server-web-proxy:

                  org.apache.hadoop.mapreduce.v2.app.TestRMContainerAllocator
                  org.apache.hadoop.yarn.server.resourcemanager.webapp.TestRMWebServicesApps
                  org.apache.hadoop.yarn.server.resourcemanager.recovery.TestZKRMStateStore
                  org.apache.hadoop.yarn.server.resourcemanager.rmcontainer.TestRMContainerImpl
                  org.apache.hadoop.yarn.server.TestMiniYARNClusterForHA

    {color:green}+1 contrib tests{color}.  The patch passed contrib unit tests.

Test results: https://builds.apache.org/job/PreCommit-YARN-Build/2992//testReport/
Findbugs warnings: https://builds.apache.org/job/PreCommit-YARN-Build/2992//artifact/trunk/patchprocess/newPatchFindbugsWarningshadoop-yarn-server-resourcemanager.html
Console output: https://builds.apache.org/job/PreCommit-YARN-Build/2992//console

This message is automatically generated.


======================================================================
======================================================================
    Adding comment to Jira.
======================================================================
======================================================================


Comment added.
0d17279c0c949c65c798e8cb959ea643ee640594 logged out


======================================================================
======================================================================
    Finished build.
======================================================================
======================================================================


Build step 'Execute shell' marked build as failure
Archiving artifacts
[description-setter] Could not determine description.
Recording test results
Email was triggered for: Failure
Sending email for trigger: Failure



###################################################################################
############################## FAILED TESTS (if any) ##############################
10 tests failed.
FAILED:  org.apache.hadoop.mapreduce.v2.app.TestRMContainerAllocator.testCompletedTasksRecalculateSchedule

Error Message:
java.lang.NullPointerException

Stack Trace:
org.apache.hadoop.yarn.exceptions.YarnRuntimeException: java.lang.NullPointerException
	at org.apache.hadoop.yarn.server.resourcemanager.scheduler.AbstractYarnScheduler.getTransferredContainers(AbstractYarnScheduler.java:51)
	at org.apache.hadoop.yarn.server.resourcemanager.ApplicationMasterService.registerApplicationMaster(ApplicationMasterService.java:278)
	at org.apache.hadoop.mapreduce.v2.app.rm.RMCommunicator.register(RMCommunicator.java:154)
	at org.apache.hadoop.mapreduce.v2.app.TestRMContainerAllocator$MyContainerAllocator.register(TestRMContainerAllocator.java:1476)
	at org.apache.hadoop.mapreduce.v2.app.rm.RMCommunicator.serviceStart(RMCommunicator.java:115)
	at org.apache.hadoop.mapreduce.v2.app.rm.RMContainerAllocator.serviceStart(RMContainerAllocator.java:219)
	at org.apache.hadoop.service.AbstractService.start(AbstractService.java:193)
	at org.apache.hadoop.mapreduce.v2.app.TestRMContainerAllocator$MyContainerAllocator.<init>(TestRMContainerAllocator.java:1444)
	at org.apache.hadoop.mapreduce.v2.app.TestRMContainerAllocator$RecalculateContainerAllocator.<init>(TestRMContainerAllocator.java:1629)
	at org.apache.hadoop.mapreduce.v2.app.TestRMContainerAllocator.testCompletedTasksRecalculateSchedule(TestRMContainerAllocator.java:1665)


FAILED:  org.apache.hadoop.yarn.server.resourcemanager.recovery.TestZKRMStateStore.testFencing

Error Message:
Error starting http server

Stack Trace:
org.apache.hadoop.yarn.webapp.WebAppException: Error starting http server
	at sun.nio.ch.Net.bind(Native Method)
	at sun.nio.ch.ServerSocketChannelImpl.bind(ServerSocketChannelImpl.java:126)
	at sun.nio.ch.ServerSocketAdaptor.bind(ServerSocketAdaptor.java:59)
	at org.mortbay.jetty.nio.SelectChannelConnector.open(SelectChannelConnector.java:216)
	at org.apache.hadoop.http.HttpServer2.openListeners(HttpServer2.java:845)
	at org.apache.hadoop.http.HttpServer2.start(HttpServer2.java:786)
	at org.apache.hadoop.yarn.webapp.WebApps$Builder.start(WebApps.java:247)
	at org.apache.hadoop.yarn.server.resourcemanager.ResourceManager.startWepApp(ResourceManager.java:775)
	at org.apache.hadoop.yarn.server.resourcemanager.ResourceManager.serviceStart(ResourceManager.java:866)
	at org.apache.hadoop.service.AbstractService.start(AbstractService.java:193)
	at org.apache.hadoop.yarn.server.resourcemanager.recovery.TestZKRMStateStore.testFencing(TestZKRMStateStore.java:175)


FAILED:  org.apache.hadoop.yarn.server.resourcemanager.rmcontainer.TestRMContainerImpl.testReleaseWhileRunning

Error Message:
expected:<[http:]//host:3465/logs/hos...> but was:<[]//host:3465/logs/hos...>

Stack Trace:
org.junit.ComparisonFailure: expected:<[http:]//host:3465/logs/hos...> but was:<[]//host:3465/logs/hos...>
	at org.junit.Assert.assertEquals(Assert.java:125)
	at org.junit.Assert.assertEquals(Assert.java:147)
	at org.apache.hadoop.yarn.server.resourcemanager.rmcontainer.TestRMContainerImpl.testReleaseWhileRunning(TestRMContainerImpl.java:107)


FAILED:  org.apache.hadoop.yarn.server.resourcemanager.rmcontainer.TestRMContainerImpl.testExpireWhileRunning

Error Message:
expected:<[http:]//host:3465/logs/hos...> but was:<[]//host:3465/logs/hos...>

Stack Trace:
org.junit.ComparisonFailure: expected:<[http:]//host:3465/logs/hos...> but was:<[]//host:3465/logs/hos...>
	at org.junit.Assert.assertEquals(Assert.java:125)
	at org.junit.Assert.assertEquals(Assert.java:147)
	at org.apache.hadoop.yarn.server.resourcemanager.rmcontainer.TestRMContainerImpl.testExpireWhileRunning(TestRMContainerImpl.java:194)


FAILED:  org.apache.hadoop.yarn.server.resourcemanager.webapp.TestRMWebServicesApps.testAppAttempts

Error Message:
logsLink doesn't match

Stack Trace:
java.lang.AssertionError: logsLink doesn't match
	at org.junit.Assert.fail(Assert.java:93)
	at org.junit.Assert.assertTrue(Assert.java:43)
	at org.apache.hadoop.yarn.server.resourcemanager.webapp.TestRMWebServicesApps.verifyAppAttemptInfoGeneric(TestRMWebServicesApps.java:1609)
	at org.apache.hadoop.yarn.server.resourcemanager.webapp.TestRMWebServicesApps.verifyAppAttemptsInfo(TestRMWebServicesApps.java:1588)
	at org.apache.hadoop.yarn.server.resourcemanager.webapp.TestRMWebServicesApps.testAppAttemptsHelper(TestRMWebServicesApps.java:1532)
	at org.apache.hadoop.yarn.server.resourcemanager.webapp.TestRMWebServicesApps.testAppAttempts(TestRMWebServicesApps.java:1382)


FAILED:  org.apache.hadoop.yarn.server.resourcemanager.webapp.TestRMWebServicesApps.testMultipleAppAttempts

Error Message:
logsLink doesn't match

Stack Trace:
java.lang.AssertionError: logsLink doesn't match
	at org.junit.Assert.fail(Assert.java:93)
	at org.junit.Assert.assertTrue(Assert.java:43)
	at org.apache.hadoop.yarn.server.resourcemanager.webapp.TestRMWebServicesApps.verifyAppAttemptInfoGeneric(TestRMWebServicesApps.java:1609)
	at org.apache.hadoop.yarn.server.resourcemanager.webapp.TestRMWebServicesApps.verifyAppAttemptsInfo(TestRMWebServicesApps.java:1588)
	at org.apache.hadoop.yarn.server.resourcemanager.webapp.TestRMWebServicesApps.testAppAttemptsHelper(TestRMWebServicesApps.java:1532)
	at org.apache.hadoop.yarn.server.resourcemanager.webapp.TestRMWebServicesApps.testMultipleAppAttempts(TestRMWebServicesApps.java:1413)


FAILED:  org.apache.hadoop.yarn.server.resourcemanager.webapp.TestRMWebServicesApps.testAppAttemptsSlash

Error Message:
logsLink doesn't match

Stack Trace:
java.lang.AssertionError: logsLink doesn't match
	at org.junit.Assert.fail(Assert.java:93)
	at org.junit.Assert.assertTrue(Assert.java:43)
	at org.apache.hadoop.yarn.server.resourcemanager.webapp.TestRMWebServicesApps.verifyAppAttemptInfoGeneric(TestRMWebServicesApps.java:1609)
	at org.apache.hadoop.yarn.server.resourcemanager.webapp.TestRMWebServicesApps.verifyAppAttemptsInfo(TestRMWebServicesApps.java:1588)
	at org.apache.hadoop.yarn.server.resourcemanager.webapp.TestRMWebServicesApps.testAppAttemptsHelper(TestRMWebServicesApps.java:1532)
	at org.apache.hadoop.yarn.server.resourcemanager.webapp.TestRMWebServicesApps.testAppAttemptsSlash(TestRMWebServicesApps.java:1424)


FAILED:  org.apache.hadoop.yarn.server.resourcemanager.webapp.TestRMWebServicesApps.testAppAttemtpsDefault

Error Message:
logsLink doesn't match

Stack Trace:
java.lang.AssertionError: logsLink doesn't match
	at org.junit.Assert.fail(Assert.java:93)
	at org.junit.Assert.assertTrue(Assert.java:43)
	at org.apache.hadoop.yarn.server.resourcemanager.webapp.TestRMWebServicesApps.verifyAppAttemptInfoGeneric(TestRMWebServicesApps.java:1609)
	at org.apache.hadoop.yarn.server.resourcemanager.webapp.TestRMWebServicesApps.verifyAppAttemptsInfo(TestRMWebServicesApps.java:1588)
	at org.apache.hadoop.yarn.server.resourcemanager.webapp.TestRMWebServicesApps.testAppAttemptsHelper(TestRMWebServicesApps.java:1532)
	at org.apache.hadoop.yarn.server.resourcemanager.webapp.TestRMWebServicesApps.testAppAttemtpsDefault(TestRMWebServicesApps.java:1435)


FAILED:  org.apache.hadoop.yarn.server.resourcemanager.webapp.TestRMWebServicesApps.testAppAttemptsXML

Error Message:
logsLink doesn't match

Stack Trace:
java.lang.AssertionError: logsLink doesn't match
	at org.junit.Assert.fail(Assert.java:93)
	at org.junit.Assert.assertTrue(Assert.java:43)
	at org.apache.hadoop.yarn.server.resourcemanager.webapp.TestRMWebServicesApps.verifyAppAttemptInfoGeneric(TestRMWebServicesApps.java:1609)
	at org.apache.hadoop.yarn.server.resourcemanager.webapp.TestRMWebServicesApps.verifyAppAttemptsXML(TestRMWebServicesApps.java:1572)
	at org.apache.hadoop.yarn.server.resourcemanager.webapp.TestRMWebServicesApps.testAppAttemptsXML(TestRMWebServicesApps.java:1561)


FAILED:  org.apache.hadoop.yarn.server.TestMiniYARNClusterForHA.testClusterWorks

Error Message:
java.io.IOException: ResourceManager failed to start. Final state is STOPPED

Stack Trace:
org.apache.hadoop.yarn.exceptions.YarnRuntimeException: java.io.IOException: ResourceManager
failed to start. Final state is STOPPED
	at org.apache.hadoop.yarn.server.MiniYARNCluster.startResourceManager(MiniYARNCluster.java:297)
	at org.apache.hadoop.yarn.server.MiniYARNCluster.access$500(MiniYARNCluster.java:87)
	at org.apache.hadoop.yarn.server.MiniYARNCluster$ResourceManagerWrapper.serviceStart(MiniYARNCluster.java:422)
	at org.apache.hadoop.service.AbstractService.start(AbstractService.java:193)
	at org.apache.hadoop.service.CompositeService.serviceStart(CompositeService.java:120)
	at org.apache.hadoop.service.AbstractService.start(AbstractService.java:193)
	at org.apache.hadoop.yarn.server.TestMiniYARNClusterForHA.setup(TestMiniYARNClusterForHA.java:49)



Mime
  • Unnamed multipart/mixed (inline, None, 0 bytes)
View raw message