hadoop-yarn-dev mailing list archives

Site index · List index
Message view « Date » · « Thread »
Top « Date » · « Thread »
From Apache Jenkins Server <jenk...@builds.apache.org>
Subject Failed: YARN-1673 PreCommit Build #2989
Date Mon, 03 Feb 2014 08:31:31 GMT
Jira: https://issues.apache.org/jira/browse/YARN-1673
Build: https://builds.apache.org/job/PreCommit-YARN-Build/2989/

###################################################################################
########################## LAST 60 LINES OF THE CONSOLE ###########################
[...truncated 2934 lines...]
  http://issues.apache.org/jira/secure/attachment/12626616/YARN-1673.patch
  against trunk revision .

    {color:green}+1 @author{color}.  The patch does not contain any @author tags.

    {color:red}-1 tests included{color}.  The patch doesn't appear to include any new or modified
tests.
                        Please justify why no new tests are needed for this patch.
                        Also please list what manual steps were performed to verify this patch.

    {color:green}+1 javac{color}.  The applied patch does not increase the total number of
javac compiler warnings.

    {color:green}+1 javadoc{color}.  The javadoc tool did not generate any warning messages.

    {color:green}+1 eclipse:eclipse{color}.  The patch built with eclipse:eclipse.

    {color:green}+1 findbugs{color}.  The patch does not introduce any new Findbugs (version
1.3.9) warnings.

    {color:green}+1 release audit{color}.  The applied patch does not increase the total number
of release audit warnings.

    {color:red}-1 core tests{color}.  The patch failed these unit tests in hadoop-yarn-project/hadoop-yarn/hadoop-yarn-client:

                  org.apache.hadoop.yarn.client.cli.TestYarnCLI

                                      The following test timeouts occurred in hadoop-yarn-project/hadoop-yarn/hadoop-yarn-client:

org.apache.hadoop.yarn.client.api.impl.TestNMClient

    {color:green}+1 contrib tests{color}.  The patch passed contrib unit tests.

Test results: https://builds.apache.org/job/PreCommit-YARN-Build/2989//testReport/
Console output: https://builds.apache.org/job/PreCommit-YARN-Build/2989//console

This message is automatically generated.


======================================================================
======================================================================
    Adding comment to Jira.
======================================================================
======================================================================


Comment added.
4261ea6cfcb684a5ec7dd19d774b51456d78c213 logged out


======================================================================
======================================================================
    Finished build.
======================================================================
======================================================================


Build step 'Execute shell' marked build as failure
Archiving artifacts
[description-setter] Could not determine description.
Recording test results
Email was triggered for: Failure
Sending email for trigger: Failure



###################################################################################
############################## FAILED TESTS (if any) ##############################
2 tests failed.
FAILED:  org.apache.hadoop.yarn.client.cli.TestYarnCLI.testAppsHelpCommand

Error Message:
null

Stack Trace:
java.lang.NullPointerException: null
	at org.apache.hadoop.yarn.client.cli.ApplicationCLI.killApplication(ApplicationCLI.java:360)
	at org.apache.hadoop.yarn.client.cli.ApplicationCLI.run(ApplicationCLI.java:204)
	at org.apache.hadoop.yarn.client.cli.TestYarnCLI.testAppsHelpCommand(TestYarnCLI.java:683)


FAILED:  org.apache.hadoop.yarn.client.cli.TestYarnCLI.testKillApplication

Error Message:
expected:<0> but was:<-1>

Stack Trace:
java.lang.AssertionError: expected:<0> but was:<-1>
	at org.junit.Assert.fail(Assert.java:93)
	at org.junit.Assert.failNotEquals(Assert.java:647)
	at org.junit.Assert.assertEquals(Assert.java:128)
	at org.junit.Assert.assertEquals(Assert.java:472)
	at org.junit.Assert.assertEquals(Assert.java:456)
	at org.apache.hadoop.yarn.client.cli.TestYarnCLI.testKillApplication(TestYarnCLI.java:721)



Mime
  • Unnamed multipart/mixed (inline, None, 0 bytes)
View raw message