hadoop-yarn-dev mailing list archives

Site index · List index
Message view « Date » · « Thread »
Top « Date » · « Thread »
From Apache Jenkins Server <jenk...@builds.apache.org>
Subject Failed: YARN-1734 PreCommit Build #3116
Date Tue, 18 Feb 2014 20:40:27 GMT
Jira: https://issues.apache.org/jira/browse/YARN-1734
Build: https://builds.apache.org/job/PreCommit-YARN-Build/3116/

###################################################################################
########################## LAST 60 LINES OF THE CONSOLE ###########################
[...truncated 3691 lines...]
{color:red}-1 overall{color}.  Here are the results of testing the latest attachment 
  http://issues.apache.org/jira/secure/attachment/12629606/YARN-1734.1.patch
  against trunk revision .

    {color:green}+1 @author{color}.  The patch does not contain any @author tags.

    {color:green}+1 tests included{color}.  The patch appears to include 5 new or modified
test files.

    {color:green}+1 javac{color}.  The applied patch does not increase the total number of
javac compiler warnings.

    {color:green}+1 javadoc{color}.  There were no new javadoc warning messages.

    {color:green}+1 eclipse:eclipse{color}.  The patch built with eclipse:eclipse.

    {color:green}+1 findbugs{color}.  The patch does not introduce any new Findbugs (version
1.3.9) warnings.

    {color:green}+1 release audit{color}.  The applied patch does not increase the total number
of release audit warnings.

    {color:red}-1 core tests{color}.  The patch failed these unit tests in hadoop-yarn-project/hadoop-yarn/hadoop-yarn-api
hadoop-yarn-project/hadoop-yarn/hadoop-yarn-client hadoop-yarn-project/hadoop-yarn/hadoop-yarn-common
hadoop-yarn-project/hadoop-yarn/hadoop-yarn-server/hadoop-yarn-server-resourcemanager hadoop-yarn-project/hadoop-yarn/hadoop-yarn-server/hadoop-yarn-server-tests:

                  org.apache.hadoop.yarn.client.TestResourceManagerAdministrationProtocolPBClientImpl
                  org.apache.hadoop.yarn.client.api.impl.TestAMRMClient
                  org.apache.hadoop.yarn.client.TestGetGroups
                  org.apache.hadoop.yarn.client.api.impl.TestNMClient
                  org.apache.hadoop.yarn.client.TestRMFailover
                  org.apache.hadoop.yarn.client.api.impl.TestYarnClient

    {color:green}+1 contrib tests{color}.  The patch passed contrib unit tests.

Test results: https://builds.apache.org/job/PreCommit-YARN-Build/3116//testReport/
Console output: https://builds.apache.org/job/PreCommit-YARN-Build/3116//console

This message is automatically generated.


======================================================================
======================================================================
    Adding comment to Jira.
======================================================================
======================================================================


Comment added.
8c7c3f85d165bf2f96db9306d3ac2f035ce5c325 logged out


======================================================================
======================================================================
    Finished build.
======================================================================
======================================================================


Build step 'Execute shell' marked build as failure
Archiving artifacts
[description-setter] Could not determine description.
Recording test results
Email was triggered for: Failure
Sending email for trigger: Failure



###################################################################################
############################## FAILED TESTS (if any) ##############################
16 tests failed.
FAILED:  org.apache.hadoop.yarn.client.TestGetGroups.org.apache.hadoop.yarn.client.TestGetGroups

Error Message:
java.io.FileNotFoundException: file:/home/jenkins/.m2/repository/org/apache/hadoop/hadoop-yarn-server-tests/3.0.0-SNAPSHOT/hadoop-yarn-server-tests-3.0.0-SNAPSHOT-tests.jar!/yarn-site.xml
(No such file or directory)

Stack Trace:
org.apache.hadoop.service.ServiceStateException: java.io.FileNotFoundException: file:/home/jenkins/.m2/repository/org/apache/hadoop/hadoop-yarn-server-tests/3.0.0-SNAPSHOT/hadoop-yarn-server-tests-3.0.0-SNAPSHOT-tests.jar!/yarn-site.xml
(No such file or directory)
	at java.io.FileInputStream.open(Native Method)
	at java.io.FileInputStream.<init>(FileInputStream.java:120)
	at org.apache.hadoop.yarn.LocalConfigurationProvider.getConfigurationContext(LocalConfigurationProvider.java:62)
	at org.apache.hadoop.yarn.server.resourcemanager.ResourceManager.serviceInit(ResourceManager.java:192)
	at org.apache.hadoop.service.AbstractService.init(AbstractService.java:163)
	at org.apache.hadoop.yarn.client.TestGetGroups.setUpResourceManager(TestGetGroups.java:52)


FAILED:  org.apache.hadoop.yarn.client.TestRMFailover.testExplicitFailover

Error Message:
java.io.FileNotFoundException: file:/home/jenkins/.m2/repository/org/apache/hadoop/hadoop-yarn-server-tests/3.0.0-SNAPSHOT/hadoop-yarn-server-tests-3.0.0-SNAPSHOT-tests.jar!/yarn-site.xml
(No such file or directory)

Stack Trace:
org.apache.hadoop.service.ServiceStateException: java.io.FileNotFoundException: file:/home/jenkins/.m2/repository/org/apache/hadoop/hadoop-yarn-server-tests/3.0.0-SNAPSHOT/hadoop-yarn-server-tests-3.0.0-SNAPSHOT-tests.jar!/yarn-site.xml
(No such file or directory)
	at java.io.FileInputStream.open(Native Method)
	at java.io.FileInputStream.<init>(FileInputStream.java:120)
	at org.apache.hadoop.yarn.LocalConfigurationProvider.getConfigurationContext(LocalConfigurationProvider.java:62)
	at org.apache.hadoop.yarn.server.resourcemanager.ResourceManager.serviceInit(ResourceManager.java:192)
	at org.apache.hadoop.service.AbstractService.init(AbstractService.java:163)
	at org.apache.hadoop.yarn.server.MiniYARNCluster.initResourceManager(MiniYARNCluster.java:265)
	at org.apache.hadoop.yarn.server.MiniYARNCluster.access$400(MiniYARNCluster.java:87)
	at org.apache.hadoop.yarn.server.MiniYARNCluster$ResourceManagerWrapper.serviceInit(MiniYARNCluster.java:416)
	at org.apache.hadoop.service.AbstractService.init(AbstractService.java:163)
	at org.apache.hadoop.service.CompositeService.serviceInit(CompositeService.java:107)
	at org.apache.hadoop.yarn.server.MiniYARNCluster.serviceInit(MiniYARNCluster.java:241)
	at org.apache.hadoop.service.AbstractService.init(AbstractService.java:163)
	at org.apache.hadoop.yarn.client.TestRMFailover.testExplicitFailover(TestRMFailover.java:178)


FAILED:  org.apache.hadoop.yarn.client.TestRMFailover.testAutomaticFailover

Error Message:
java.io.FileNotFoundException: file:/home/jenkins/.m2/repository/org/apache/hadoop/hadoop-yarn-server-tests/3.0.0-SNAPSHOT/hadoop-yarn-server-tests-3.0.0-SNAPSHOT-tests.jar!/yarn-site.xml
(No such file or directory)

Stack Trace:
org.apache.hadoop.service.ServiceStateException: java.io.FileNotFoundException: file:/home/jenkins/.m2/repository/org/apache/hadoop/hadoop-yarn-server-tests/3.0.0-SNAPSHOT/hadoop-yarn-server-tests-3.0.0-SNAPSHOT-tests.jar!/yarn-site.xml
(No such file or directory)
	at java.io.FileInputStream.open(Native Method)
	at java.io.FileInputStream.<init>(FileInputStream.java:120)
	at org.apache.hadoop.yarn.LocalConfigurationProvider.getConfigurationContext(LocalConfigurationProvider.java:62)
	at org.apache.hadoop.yarn.server.resourcemanager.ResourceManager.serviceInit(ResourceManager.java:192)
	at org.apache.hadoop.service.AbstractService.init(AbstractService.java:163)
	at org.apache.hadoop.yarn.server.MiniYARNCluster.initResourceManager(MiniYARNCluster.java:265)
	at org.apache.hadoop.yarn.server.MiniYARNCluster.access$400(MiniYARNCluster.java:87)
	at org.apache.hadoop.yarn.server.MiniYARNCluster$ResourceManagerWrapper.serviceInit(MiniYARNCluster.java:416)
	at org.apache.hadoop.service.AbstractService.init(AbstractService.java:163)
	at org.apache.hadoop.service.CompositeService.serviceInit(CompositeService.java:107)
	at org.apache.hadoop.yarn.server.MiniYARNCluster.serviceInit(MiniYARNCluster.java:241)
	at org.apache.hadoop.service.AbstractService.init(AbstractService.java:163)
	at org.apache.hadoop.yarn.client.TestRMFailover.testAutomaticFailover(TestRMFailover.java:198)


FAILED:  org.apache.hadoop.yarn.client.TestRMFailover.testWebAppProxyInStandAloneMode

Error Message:
java.io.FileNotFoundException: file:/home/jenkins/.m2/repository/org/apache/hadoop/hadoop-yarn-server-tests/3.0.0-SNAPSHOT/hadoop-yarn-server-tests-3.0.0-SNAPSHOT-tests.jar!/yarn-site.xml
(No such file or directory)

Stack Trace:
org.apache.hadoop.service.ServiceStateException: java.io.FileNotFoundException: file:/home/jenkins/.m2/repository/org/apache/hadoop/hadoop-yarn-server-tests/3.0.0-SNAPSHOT/hadoop-yarn-server-tests-3.0.0-SNAPSHOT-tests.jar!/yarn-site.xml
(No such file or directory)
	at java.io.FileInputStream.open(Native Method)
	at java.io.FileInputStream.<init>(FileInputStream.java:120)
	at org.apache.hadoop.yarn.LocalConfigurationProvider.getConfigurationContext(LocalConfigurationProvider.java:62)
	at org.apache.hadoop.yarn.server.resourcemanager.ResourceManager.serviceInit(ResourceManager.java:192)
	at org.apache.hadoop.service.AbstractService.init(AbstractService.java:163)
	at org.apache.hadoop.yarn.server.MiniYARNCluster.initResourceManager(MiniYARNCluster.java:265)
	at org.apache.hadoop.yarn.server.MiniYARNCluster.access$400(MiniYARNCluster.java:87)
	at org.apache.hadoop.yarn.server.MiniYARNCluster$ResourceManagerWrapper.serviceInit(MiniYARNCluster.java:416)
	at org.apache.hadoop.service.AbstractService.init(AbstractService.java:163)
	at org.apache.hadoop.service.CompositeService.serviceInit(CompositeService.java:107)
	at org.apache.hadoop.yarn.server.MiniYARNCluster.serviceInit(MiniYARNCluster.java:241)
	at org.apache.hadoop.service.AbstractService.init(AbstractService.java:163)
	at org.apache.hadoop.yarn.client.TestRMFailover.testWebAppProxyInStandAloneMode(TestRMFailover.java:217)


FAILED:  org.apache.hadoop.yarn.client.TestRMFailover.testEmbeddedWebAppProxy

Error Message:
java.io.FileNotFoundException: file:/home/jenkins/.m2/repository/org/apache/hadoop/hadoop-yarn-server-tests/3.0.0-SNAPSHOT/hadoop-yarn-server-tests-3.0.0-SNAPSHOT-tests.jar!/yarn-site.xml
(No such file or directory)

Stack Trace:
org.apache.hadoop.service.ServiceStateException: java.io.FileNotFoundException: file:/home/jenkins/.m2/repository/org/apache/hadoop/hadoop-yarn-server-tests/3.0.0-SNAPSHOT/hadoop-yarn-server-tests-3.0.0-SNAPSHOT-tests.jar!/yarn-site.xml
(No such file or directory)
	at java.io.FileInputStream.open(Native Method)
	at java.io.FileInputStream.<init>(FileInputStream.java:120)
	at org.apache.hadoop.yarn.LocalConfigurationProvider.getConfigurationContext(LocalConfigurationProvider.java:62)
	at org.apache.hadoop.yarn.server.resourcemanager.ResourceManager.serviceInit(ResourceManager.java:192)
	at org.apache.hadoop.service.AbstractService.init(AbstractService.java:163)
	at org.apache.hadoop.yarn.server.MiniYARNCluster.initResourceManager(MiniYARNCluster.java:265)
	at org.apache.hadoop.yarn.server.MiniYARNCluster.access$400(MiniYARNCluster.java:87)
	at org.apache.hadoop.yarn.server.MiniYARNCluster$ResourceManagerWrapper.serviceInit(MiniYARNCluster.java:416)
	at org.apache.hadoop.service.AbstractService.init(AbstractService.java:163)
	at org.apache.hadoop.service.CompositeService.serviceInit(CompositeService.java:107)
	at org.apache.hadoop.yarn.server.MiniYARNCluster.serviceInit(MiniYARNCluster.java:241)
	at org.apache.hadoop.service.AbstractService.init(AbstractService.java:163)
	at org.apache.hadoop.yarn.client.TestRMFailover.testEmbeddedWebAppProxy(TestRMFailover.java:249)


FAILED:  org.apache.hadoop.yarn.client.TestResourceManagerAdministrationProtocolPBClientImpl.org.apache.hadoop.yarn.client.TestResourceManagerAdministrationProtocolPBClientImpl

Error Message:
java.io.FileNotFoundException: file:/home/jenkins/.m2/repository/org/apache/hadoop/hadoop-yarn-server-tests/3.0.0-SNAPSHOT/hadoop-yarn-server-tests-3.0.0-SNAPSHOT-tests.jar!/yarn-site.xml
(No such file or directory)

Stack Trace:
org.apache.hadoop.service.ServiceStateException: java.io.FileNotFoundException: file:/home/jenkins/.m2/repository/org/apache/hadoop/hadoop-yarn-server-tests/3.0.0-SNAPSHOT/hadoop-yarn-server-tests-3.0.0-SNAPSHOT-tests.jar!/yarn-site.xml
(No such file or directory)
	at java.io.FileInputStream.open(Native Method)
	at java.io.FileInputStream.<init>(FileInputStream.java:120)
	at org.apache.hadoop.yarn.LocalConfigurationProvider.getConfigurationContext(LocalConfigurationProvider.java:62)
	at org.apache.hadoop.yarn.server.resourcemanager.ResourceManager.serviceInit(ResourceManager.java:192)
	at org.apache.hadoop.service.AbstractService.init(AbstractService.java:163)
	at org.apache.hadoop.yarn.client.TestResourceManagerAdministrationProtocolPBClientImpl.setUpResourceManager(TestResourceManagerAdministrationProtocolPBClientImpl.java:79)


FAILED:  org.apache.hadoop.yarn.client.api.impl.TestAMRMClient.org.apache.hadoop.yarn.client.api.impl.TestAMRMClient

Error Message:
java.io.FileNotFoundException: file:/home/jenkins/.m2/repository/org/apache/hadoop/hadoop-yarn-server-tests/3.0.0-SNAPSHOT/hadoop-yarn-server-tests-3.0.0-SNAPSHOT-tests.jar!/yarn-site.xml
(No such file or directory)

Stack Trace:
org.apache.hadoop.service.ServiceStateException: java.io.FileNotFoundException: file:/home/jenkins/.m2/repository/org/apache/hadoop/hadoop-yarn-server-tests/3.0.0-SNAPSHOT/hadoop-yarn-server-tests-3.0.0-SNAPSHOT-tests.jar!/yarn-site.xml
(No such file or directory)
	at java.io.FileInputStream.open(Native Method)
	at java.io.FileInputStream.<init>(FileInputStream.java:120)
	at org.apache.hadoop.yarn.LocalConfigurationProvider.getConfigurationContext(LocalConfigurationProvider.java:62)
	at org.apache.hadoop.yarn.server.resourcemanager.ResourceManager.serviceInit(ResourceManager.java:192)
	at org.apache.hadoop.service.AbstractService.init(AbstractService.java:163)
	at org.apache.hadoop.yarn.server.MiniYARNCluster.initResourceManager(MiniYARNCluster.java:265)
	at org.apache.hadoop.yarn.server.MiniYARNCluster.access$400(MiniYARNCluster.java:87)
	at org.apache.hadoop.yarn.server.MiniYARNCluster$ResourceManagerWrapper.serviceInit(MiniYARNCluster.java:416)
	at org.apache.hadoop.service.AbstractService.init(AbstractService.java:163)
	at org.apache.hadoop.service.CompositeService.serviceInit(CompositeService.java:107)
	at org.apache.hadoop.yarn.server.MiniYARNCluster.serviceInit(MiniYARNCluster.java:241)
	at org.apache.hadoop.service.AbstractService.init(AbstractService.java:163)
	at org.apache.hadoop.yarn.client.api.impl.TestAMRMClient.setup(TestAMRMClient.java:112)


FAILED:  org.apache.hadoop.yarn.client.api.impl.TestNMClient.testNMClientNoCleanupOnStop

Error Message:
java.io.FileNotFoundException: file:/home/jenkins/.m2/repository/org/apache/hadoop/hadoop-yarn-server-tests/3.0.0-SNAPSHOT/hadoop-yarn-server-tests-3.0.0-SNAPSHOT-tests.jar!/yarn-site.xml
(No such file or directory)

Stack Trace:
org.apache.hadoop.service.ServiceStateException: java.io.FileNotFoundException: file:/home/jenkins/.m2/repository/org/apache/hadoop/hadoop-yarn-server-tests/3.0.0-SNAPSHOT/hadoop-yarn-server-tests-3.0.0-SNAPSHOT-tests.jar!/yarn-site.xml
(No such file or directory)
	at java.io.FileInputStream.open(Native Method)
	at java.io.FileInputStream.<init>(FileInputStream.java:120)
	at org.apache.hadoop.yarn.LocalConfigurationProvider.getConfigurationContext(LocalConfigurationProvider.java:62)
	at org.apache.hadoop.yarn.server.resourcemanager.ResourceManager.serviceInit(ResourceManager.java:192)
	at org.apache.hadoop.service.AbstractService.init(AbstractService.java:163)
	at org.apache.hadoop.yarn.server.MiniYARNCluster.initResourceManager(MiniYARNCluster.java:265)
	at org.apache.hadoop.yarn.server.MiniYARNCluster.access$400(MiniYARNCluster.java:87)
	at org.apache.hadoop.yarn.server.MiniYARNCluster$ResourceManagerWrapper.serviceInit(MiniYARNCluster.java:416)
	at org.apache.hadoop.service.AbstractService.init(AbstractService.java:163)
	at org.apache.hadoop.service.CompositeService.serviceInit(CompositeService.java:107)
	at org.apache.hadoop.yarn.server.MiniYARNCluster.serviceInit(MiniYARNCluster.java:241)
	at org.apache.hadoop.service.AbstractService.init(AbstractService.java:163)
	at org.apache.hadoop.yarn.client.api.impl.TestNMClient.setup(TestNMClient.java:89)


FAILED:  org.apache.hadoop.yarn.client.api.impl.TestNMClient.testNMClientNoCleanupOnStop

Error Message:
null

Stack Trace:
java.lang.NullPointerException: null
	at org.apache.hadoop.yarn.client.api.impl.TestNMClient.tearDown(TestNMClient.java:187)


FAILED:  org.apache.hadoop.yarn.client.api.impl.TestNMClient.testNMClient

Error Message:
java.io.FileNotFoundException: file:/home/jenkins/.m2/repository/org/apache/hadoop/hadoop-yarn-server-tests/3.0.0-SNAPSHOT/hadoop-yarn-server-tests-3.0.0-SNAPSHOT-tests.jar!/yarn-site.xml
(No such file or directory)

Stack Trace:
org.apache.hadoop.service.ServiceStateException: java.io.FileNotFoundException: file:/home/jenkins/.m2/repository/org/apache/hadoop/hadoop-yarn-server-tests/3.0.0-SNAPSHOT/hadoop-yarn-server-tests-3.0.0-SNAPSHOT-tests.jar!/yarn-site.xml
(No such file or directory)
	at java.io.FileInputStream.open(Native Method)
	at java.io.FileInputStream.<init>(FileInputStream.java:120)
	at org.apache.hadoop.yarn.LocalConfigurationProvider.getConfigurationContext(LocalConfigurationProvider.java:62)
	at org.apache.hadoop.yarn.server.resourcemanager.ResourceManager.serviceInit(ResourceManager.java:192)
	at org.apache.hadoop.service.AbstractService.init(AbstractService.java:163)
	at org.apache.hadoop.yarn.server.MiniYARNCluster.initResourceManager(MiniYARNCluster.java:265)
	at org.apache.hadoop.yarn.server.MiniYARNCluster.access$400(MiniYARNCluster.java:87)
	at org.apache.hadoop.yarn.server.MiniYARNCluster$ResourceManagerWrapper.serviceInit(MiniYARNCluster.java:416)
	at org.apache.hadoop.service.AbstractService.init(AbstractService.java:163)
	at org.apache.hadoop.service.CompositeService.serviceInit(CompositeService.java:107)
	at org.apache.hadoop.yarn.server.MiniYARNCluster.serviceInit(MiniYARNCluster.java:241)
	at org.apache.hadoop.service.AbstractService.init(AbstractService.java:163)
	at org.apache.hadoop.yarn.client.api.impl.TestNMClient.setup(TestNMClient.java:89)


FAILED:  org.apache.hadoop.yarn.client.api.impl.TestNMClient.testNMClient

Error Message:
null

Stack Trace:
java.lang.NullPointerException: null
	at org.apache.hadoop.yarn.client.api.impl.TestNMClient.tearDown(TestNMClient.java:187)


FAILED:  org.apache.hadoop.yarn.client.api.impl.TestYarnClient.testClientStop

Error Message:
java.io.FileNotFoundException: file:/home/jenkins/.m2/repository/org/apache/hadoop/hadoop-yarn-server-tests/3.0.0-SNAPSHOT/hadoop-yarn-server-tests-3.0.0-SNAPSHOT-tests.jar!/yarn-site.xml
(No such file or directory)

Stack Trace:
org.apache.hadoop.service.ServiceStateException: java.io.FileNotFoundException: file:/home/jenkins/.m2/repository/org/apache/hadoop/hadoop-yarn-server-tests/3.0.0-SNAPSHOT/hadoop-yarn-server-tests-3.0.0-SNAPSHOT-tests.jar!/yarn-site.xml
(No such file or directory)
	at java.io.FileInputStream.open(Native Method)
	at java.io.FileInputStream.<init>(FileInputStream.java:120)
	at org.apache.hadoop.yarn.LocalConfigurationProvider.getConfigurationContext(LocalConfigurationProvider.java:62)
	at org.apache.hadoop.yarn.server.resourcemanager.ResourceManager.serviceInit(ResourceManager.java:192)
	at org.apache.hadoop.service.AbstractService.init(AbstractService.java:163)
	at org.apache.hadoop.yarn.client.api.impl.TestYarnClient.testClientStop(TestYarnClient.java:84)


FAILED:  org.apache.hadoop.yarn.client.api.impl.TestYarnClient.testKillApplication

Error Message:
java.io.FileNotFoundException: file:/home/jenkins/.m2/repository/org/apache/hadoop/hadoop-yarn-server-tests/3.0.0-SNAPSHOT/hadoop-yarn-server-tests-3.0.0-SNAPSHOT-tests.jar!/yarn-site.xml
(No such file or directory)

Stack Trace:
org.apache.hadoop.service.ServiceStateException: java.io.FileNotFoundException: file:/home/jenkins/.m2/repository/org/apache/hadoop/hadoop-yarn-server-tests/3.0.0-SNAPSHOT/hadoop-yarn-server-tests-3.0.0-SNAPSHOT-tests.jar!/yarn-site.xml
(No such file or directory)
	at java.io.FileInputStream.open(Native Method)
	at java.io.FileInputStream.<init>(FileInputStream.java:120)
	at org.apache.hadoop.yarn.LocalConfigurationProvider.getConfigurationContext(LocalConfigurationProvider.java:62)
	at org.apache.hadoop.yarn.server.resourcemanager.ResourceManager.serviceInit(ResourceManager.java:192)
	at org.apache.hadoop.service.AbstractService.init(AbstractService.java:163)
	at org.apache.hadoop.yarn.server.resourcemanager.MockRM.<init>(MockRM.java:90)
	at org.apache.hadoop.yarn.server.resourcemanager.MockRM.<init>(MockRM.java:85)
	at org.apache.hadoop.yarn.server.resourcemanager.MockRM.<init>(MockRM.java:81)
	at org.apache.hadoop.yarn.client.api.impl.TestYarnClient.testKillApplication(TestYarnClient.java:136)


FAILED:  org.apache.hadoop.yarn.client.api.impl.TestYarnClient.testApplicationType

Error Message:
java.io.FileNotFoundException: file:/home/jenkins/.m2/repository/org/apache/hadoop/hadoop-yarn-server-tests/3.0.0-SNAPSHOT/hadoop-yarn-server-tests-3.0.0-SNAPSHOT-tests.jar!/yarn-site.xml
(No such file or directory)

Stack Trace:
org.apache.hadoop.service.ServiceStateException: java.io.FileNotFoundException: file:/home/jenkins/.m2/repository/org/apache/hadoop/hadoop-yarn-server-tests/3.0.0-SNAPSHOT/hadoop-yarn-server-tests-3.0.0-SNAPSHOT-tests.jar!/yarn-site.xml
(No such file or directory)
	at java.io.FileInputStream.open(Native Method)
	at java.io.FileInputStream.<init>(FileInputStream.java:120)
	at org.apache.hadoop.yarn.LocalConfigurationProvider.getConfigurationContext(LocalConfigurationProvider.java:62)
	at org.apache.hadoop.yarn.server.resourcemanager.ResourceManager.serviceInit(ResourceManager.java:192)
	at org.apache.hadoop.service.AbstractService.init(AbstractService.java:163)
	at org.apache.hadoop.yarn.server.resourcemanager.MockRM.<init>(MockRM.java:90)
	at org.apache.hadoop.yarn.server.resourcemanager.MockRM.<init>(MockRM.java:85)
	at org.apache.hadoop.yarn.server.resourcemanager.MockRM.<init>(MockRM.java:81)
	at org.apache.hadoop.yarn.client.api.impl.TestYarnClient.testApplicationType(TestYarnClient.java:155)


FAILED:  org.apache.hadoop.yarn.client.api.impl.TestYarnClient.testApplicationTypeLimit

Error Message:
java.io.FileNotFoundException: file:/home/jenkins/.m2/repository/org/apache/hadoop/hadoop-yarn-server-tests/3.0.0-SNAPSHOT/hadoop-yarn-server-tests-3.0.0-SNAPSHOT-tests.jar!/yarn-site.xml
(No such file or directory)

Stack Trace:
org.apache.hadoop.service.ServiceStateException: java.io.FileNotFoundException: file:/home/jenkins/.m2/repository/org/apache/hadoop/hadoop-yarn-server-tests/3.0.0-SNAPSHOT/hadoop-yarn-server-tests-3.0.0-SNAPSHOT-tests.jar!/yarn-site.xml
(No such file or directory)
	at java.io.FileInputStream.open(Native Method)
	at java.io.FileInputStream.<init>(FileInputStream.java:120)
	at org.apache.hadoop.yarn.LocalConfigurationProvider.getConfigurationContext(LocalConfigurationProvider.java:62)
	at org.apache.hadoop.yarn.server.resourcemanager.ResourceManager.serviceInit(ResourceManager.java:192)
	at org.apache.hadoop.service.AbstractService.init(AbstractService.java:163)
	at org.apache.hadoop.yarn.server.resourcemanager.MockRM.<init>(MockRM.java:90)
	at org.apache.hadoop.yarn.server.resourcemanager.MockRM.<init>(MockRM.java:85)
	at org.apache.hadoop.yarn.server.resourcemanager.MockRM.<init>(MockRM.java:81)
	at org.apache.hadoop.yarn.client.api.impl.TestYarnClient.testApplicationTypeLimit(TestYarnClient.java:171)


FAILED:  org.apache.hadoop.yarn.client.api.impl.TestYarnClient.testAMMRTokens

Error Message:
java.io.FileNotFoundException: file:/home/jenkins/.m2/repository/org/apache/hadoop/hadoop-yarn-server-tests/3.0.0-SNAPSHOT/hadoop-yarn-server-tests-3.0.0-SNAPSHOT-tests.jar!/yarn-site.xml
(No such file or directory)

Stack Trace:
org.apache.hadoop.service.ServiceStateException: java.io.FileNotFoundException: file:/home/jenkins/.m2/repository/org/apache/hadoop/hadoop-yarn-server-tests/3.0.0-SNAPSHOT/hadoop-yarn-server-tests-3.0.0-SNAPSHOT-tests.jar!/yarn-site.xml
(No such file or directory)
	at java.io.FileInputStream.open(Native Method)
	at java.io.FileInputStream.<init>(FileInputStream.java:120)
	at org.apache.hadoop.yarn.LocalConfigurationProvider.getConfigurationContext(LocalConfigurationProvider.java:62)
	at org.apache.hadoop.yarn.server.resourcemanager.ResourceManager.serviceInit(ResourceManager.java:192)
	at org.apache.hadoop.service.AbstractService.init(AbstractService.java:163)
	at org.apache.hadoop.yarn.server.MiniYARNCluster.initResourceManager(MiniYARNCluster.java:265)
	at org.apache.hadoop.yarn.server.MiniYARNCluster.access$400(MiniYARNCluster.java:87)
	at org.apache.hadoop.yarn.server.MiniYARNCluster$ResourceManagerWrapper.serviceInit(MiniYARNCluster.java:416)
	at org.apache.hadoop.service.AbstractService.init(AbstractService.java:163)
	at org.apache.hadoop.service.CompositeService.serviceInit(CompositeService.java:107)
	at org.apache.hadoop.yarn.server.MiniYARNCluster.serviceInit(MiniYARNCluster.java:241)
	at org.apache.hadoop.service.AbstractService.init(AbstractService.java:163)
	at org.apache.hadoop.yarn.client.api.impl.TestYarnClient.testAMMRTokens(TestYarnClient.java:367)



Mime
  • Unnamed multipart/mixed (inline, None, 0 bytes)
View raw message