hadoop-yarn-dev mailing list archives

Site index · List index
Message view « Date » · « Thread »
Top « Date » · « Thread »
From Apache Jenkins Server <jenk...@builds.apache.org>
Subject Failed: YARN-1410 PreCommit Build #2874
Date Sat, 11 Jan 2014 04:08:09 GMT
Jira: https://issues.apache.org/jira/browse/YARN-1410
Build: https://builds.apache.org/job/PreCommit-YARN-Build/2874/

###################################################################################
########################## LAST 60 LINES OF THE CONSOLE ###########################
[...truncated 3175 lines...]




{color:red}-1 overall{color}.  Here are the results of testing the latest attachment 
  http://issues.apache.org/jira/secure/attachment/12622488/YARN-1410.2.patch
  against trunk revision .

    {color:green}+1 @author{color}.  The patch does not contain any @author tags.

    {color:green}+1 tests included{color}.  The patch appears to include 1 new or modified
test files.

    {color:green}+1 javac{color}.  The applied patch does not increase the total number of
javac compiler warnings.

    {color:green}+1 javadoc{color}.  The javadoc tool did not generate any warning messages.

    {color:green}+1 eclipse:eclipse{color}.  The patch built with eclipse:eclipse.

    {color:green}+1 findbugs{color}.  The patch does not introduce any new Findbugs (version
1.3.9) warnings.

    {color:green}+1 release audit{color}.  The applied patch does not increase the total number
of release audit warnings.

    {color:red}-1 core tests{color}.  The patch failed these unit tests in hadoop-yarn-project/hadoop-yarn/hadoop-yarn-api
hadoop-yarn-project/hadoop-yarn/hadoop-yarn-client hadoop-yarn-project/hadoop-yarn/hadoop-yarn-server/hadoop-yarn-server-resourcemanager:

                  org.apache.hadoop.yarn.client.api.impl.TestYarnClient
                  org.apache.hadoop.yarn.server.resourcemanager.webapp.TestRMWebServicesApps

    {color:green}+1 contrib tests{color}.  The patch passed contrib unit tests.

Test results: https://builds.apache.org/job/PreCommit-YARN-Build/2874//testReport/
Console output: https://builds.apache.org/job/PreCommit-YARN-Build/2874//console

This message is automatically generated.


======================================================================
======================================================================
    Adding comment to Jira.
======================================================================
======================================================================


Comment added.
3dbf290bc858a772c4a35a183e35a713ebfdb292 logged out


======================================================================
======================================================================
    Finished build.
======================================================================
======================================================================


Build step 'Execute shell' marked build as failure
Archiving artifacts
[description-setter] Could not determine description.
Recording test results
Email was triggered for: Failure
Sending email for trigger: Failure



###################################################################################
############################## FAILED TESTS (if any) ##############################
2 tests failed.
FAILED:  org.apache.hadoop.yarn.client.api.impl.TestYarnClient.testSubmitApplication

Error Message:
Exception is not expected.

Stack Trace:
junit.framework.AssertionFailedError: Exception is not expected.
	at junit.framework.Assert.fail(Assert.java:50)
	at org.apache.hadoop.yarn.client.api.impl.TestYarnClient.testSubmitApplication(TestYarnClient.java:123)


FAILED:  org.apache.hadoop.yarn.server.resourcemanager.webapp.TestRMWebServicesApps.testMultipleAppAttempts

Error Message:
Attempt state is not correct (timedout) expected:<ALLOCATED> but was:<SCHEDULED>

Stack Trace:
junit.framework.AssertionFailedError: Attempt state is not correct (timedout) expected:<ALLOCATED>
but was:<SCHEDULED>
	at junit.framework.Assert.fail(Assert.java:50)
	at junit.framework.Assert.failNotEquals(Assert.java:287)
	at junit.framework.Assert.assertEquals(Assert.java:67)
	at org.apache.hadoop.yarn.server.resourcemanager.MockRM.waitForState(MockRM.java:127)
	at org.apache.hadoop.yarn.server.resourcemanager.webapp.TestRMWebServicesApps.testMultipleAppAttempts(TestRMWebServicesApps.java:1413)



Mime
  • Unnamed multipart/mixed (inline, None, 0 bytes)
View raw message