hadoop-yarn-dev mailing list archives

Site index · List index
Message view « Date » · « Thread »
Top « Date » · « Thread »
From Apache Jenkins Server <jenk...@builds.apache.org>
Subject Failed: YARN-1553 PreCommit Build #2777
Date Fri, 03 Jan 2014 00:47:05 GMT
Jira: https://issues.apache.org/jira/browse/YARN-1553
Build: https://builds.apache.org/job/PreCommit-YARN-Build/2777/

###################################################################################
########################## LAST 60 LINES OF THE CONSOLE ###########################
[...truncated 5754 lines...]



{color:red}-1 overall{color}.  Here are the results of testing the latest attachment 
  http://issues.apache.org/jira/secure/attachment/12621133/YARN-1553.001.patch
  against trunk revision .

    {color:green}+1 @author{color}.  The patch does not contain any @author tags.

    {color:green}+1 tests included{color}.  The patch appears to include 6 new or modified
test files.

    {color:green}+1 javac{color}.  The applied patch does not increase the total number of
javac compiler warnings.

    {color:green}+1 javadoc{color}.  The javadoc tool did not generate any warning messages.

    {color:green}+1 eclipse:eclipse{color}.  The patch built with eclipse:eclipse.

    {color:red}-1 findbugs{color}.  The patch appears to introduce 1 new Findbugs (version
1.3.9) warnings.

    {color:green}+1 release audit{color}.  The applied patch does not increase the total number
of release audit warnings.

    {color:red}-1 core tests{color}.  The patch failed these unit tests in hadoop-common-project/hadoop-common
hadoop-mapreduce-project/hadoop-mapreduce-client/hadoop-mapreduce-client-app hadoop-mapreduce-project/hadoop-mapreduce-client/hadoop-mapreduce-client-common
hadoop-mapreduce-project/hadoop-mapreduce-client/hadoop-mapreduce-client-core hadoop-mapreduce-project/hadoop-mapreduce-client/hadoop-mapreduce-client-hs
hadoop-mapreduce-project/hadoop-mapreduce-client/hadoop-mapreduce-client-jobclient hadoop-yarn-project/hadoop-yarn/hadoop-yarn-api
hadoop-yarn-project/hadoop-yarn/hadoop-yarn-common hadoop-yarn-project/hadoop-yarn/hadoop-yarn-server/hadoop-yarn-server-nodemanager
hadoop-yarn-project/hadoop-yarn/hadoop-yarn-server/hadoop-yarn-server-resourcemanager hadoop-yarn-project/hadoop-yarn/hadoop-yarn-server/hadoop-yarn-server-tests
hadoop-yarn-project/hadoop-yarn/hadoop-yarn-server/hadoop-yarn-server-web-proxy:

                  org.apache.hadoop.yarn.server.resourcemanager.webapp.TestRMWebServicesApps
                  org.apache.hadoop.yarn.server.resourcemanager.recovery.TestZKRMStateStore

    {color:green}+1 contrib tests{color}.  The patch passed contrib unit tests.

Test results: https://builds.apache.org/job/PreCommit-YARN-Build/2777//testReport/
Findbugs warnings: https://builds.apache.org/job/PreCommit-YARN-Build/2777//artifact/trunk/patchprocess/newPatchFindbugsWarningshadoop-yarn-server-resourcemanager.html
Console output: https://builds.apache.org/job/PreCommit-YARN-Build/2777//console

This message is automatically generated.


======================================================================
======================================================================
    Adding comment to Jira.
======================================================================
======================================================================


Comment added.
10e64b7265a647882b55e1ff1bda67ed6955f49d logged out


======================================================================
======================================================================
    Finished build.
======================================================================
======================================================================


Build step 'Execute shell' marked build as failure
Archiving artifacts
[description-setter] Could not determine description.
Recording test results
Email was triggered for: Failure
Sending email for trigger: Failure



###################################################################################
############################## FAILED TESTS (if any) ##############################
6 tests failed.
REGRESSION:  org.apache.hadoop.yarn.server.resourcemanager.recovery.TestZKRMStateStore.testFencing

Error Message:
Error when transitioning to Active mode

Stack Trace:
org.apache.hadoop.ha.ServiceFailedException: Error when transitioning to Active mode
	at sun.nio.ch.Net.bind(Native Method)
	at sun.nio.ch.ServerSocketChannelImpl.bind(ServerSocketChannelImpl.java:126)
	at sun.nio.ch.ServerSocketAdaptor.bind(ServerSocketAdaptor.java:59)
	at org.mortbay.jetty.nio.SelectChannelConnector.open(SelectChannelConnector.java:216)
	at org.apache.hadoop.http.HttpServer.openListeners(HttpServer.java:973)
	at org.apache.hadoop.http.HttpServer.start(HttpServer.java:914)
	at org.apache.hadoop.yarn.webapp.WebApps$Builder.start(WebApps.java:245)
	at org.apache.hadoop.yarn.server.resourcemanager.ResourceManager.startWepApp(ResourceManager.java:779)
	at org.apache.hadoop.yarn.server.resourcemanager.ResourceManager$RMActiveServices.serviceStart(ResourceManager.java:446)
	at org.apache.hadoop.service.AbstractService.start(AbstractService.java:193)
	at org.apache.hadoop.yarn.server.resourcemanager.ResourceManager.startActiveServices(ResourceManager.java:799)
	at org.apache.hadoop.yarn.server.resourcemanager.ResourceManager.transitionToActive(ResourceManager.java:830)
	at org.apache.hadoop.yarn.server.resourcemanager.AdminService.transitionToActive(AdminService.java:202)
	at org.apache.hadoop.yarn.server.resourcemanager.recovery.TestZKRMStateStore.testFencing(TestZKRMStateStore.java:176)


REGRESSION:  org.apache.hadoop.yarn.server.resourcemanager.webapp.TestRMWebServicesApps.testAppAttempts

Error Message:
logsLink doesn't match

Stack Trace:
java.lang.AssertionError: logsLink doesn't match
	at org.junit.Assert.fail(Assert.java:93)
	at org.junit.Assert.assertTrue(Assert.java:43)
	at org.apache.hadoop.yarn.server.resourcemanager.webapp.TestRMWebServicesApps.verifyAppAttemptInfoGeneric(TestRMWebServicesApps.java:1611)
	at org.apache.hadoop.yarn.server.resourcemanager.webapp.TestRMWebServicesApps.verifyAppAttemptsInfo(TestRMWebServicesApps.java:1590)
	at org.apache.hadoop.yarn.server.resourcemanager.webapp.TestRMWebServicesApps.testAppAttemptsHelper(TestRMWebServicesApps.java:1534)
	at org.apache.hadoop.yarn.server.resourcemanager.webapp.TestRMWebServicesApps.testAppAttempts(TestRMWebServicesApps.java:1385)


REGRESSION:  org.apache.hadoop.yarn.server.resourcemanager.webapp.TestRMWebServicesApps.testMultipleAppAttempts

Error Message:
logsLink doesn't match

Stack Trace:
java.lang.AssertionError: logsLink doesn't match
	at org.junit.Assert.fail(Assert.java:93)
	at org.junit.Assert.assertTrue(Assert.java:43)
	at org.apache.hadoop.yarn.server.resourcemanager.webapp.TestRMWebServicesApps.verifyAppAttemptInfoGeneric(TestRMWebServicesApps.java:1611)
	at org.apache.hadoop.yarn.server.resourcemanager.webapp.TestRMWebServicesApps.verifyAppAttemptsInfo(TestRMWebServicesApps.java:1590)
	at org.apache.hadoop.yarn.server.resourcemanager.webapp.TestRMWebServicesApps.testAppAttemptsHelper(TestRMWebServicesApps.java:1534)
	at org.apache.hadoop.yarn.server.resourcemanager.webapp.TestRMWebServicesApps.testMultipleAppAttempts(TestRMWebServicesApps.java:1415)


REGRESSION:  org.apache.hadoop.yarn.server.resourcemanager.webapp.TestRMWebServicesApps.testAppAttemptsSlash

Error Message:
logsLink doesn't match

Stack Trace:
java.lang.AssertionError: logsLink doesn't match
	at org.junit.Assert.fail(Assert.java:93)
	at org.junit.Assert.assertTrue(Assert.java:43)
	at org.apache.hadoop.yarn.server.resourcemanager.webapp.TestRMWebServicesApps.verifyAppAttemptInfoGeneric(TestRMWebServicesApps.java:1611)
	at org.apache.hadoop.yarn.server.resourcemanager.webapp.TestRMWebServicesApps.verifyAppAttemptsInfo(TestRMWebServicesApps.java:1590)
	at org.apache.hadoop.yarn.server.resourcemanager.webapp.TestRMWebServicesApps.testAppAttemptsHelper(TestRMWebServicesApps.java:1534)
	at org.apache.hadoop.yarn.server.resourcemanager.webapp.TestRMWebServicesApps.testAppAttemptsSlash(TestRMWebServicesApps.java:1426)


REGRESSION:  org.apache.hadoop.yarn.server.resourcemanager.webapp.TestRMWebServicesApps.testAppAttemtpsDefault

Error Message:
logsLink doesn't match

Stack Trace:
java.lang.AssertionError: logsLink doesn't match
	at org.junit.Assert.fail(Assert.java:93)
	at org.junit.Assert.assertTrue(Assert.java:43)
	at org.apache.hadoop.yarn.server.resourcemanager.webapp.TestRMWebServicesApps.verifyAppAttemptInfoGeneric(TestRMWebServicesApps.java:1611)
	at org.apache.hadoop.yarn.server.resourcemanager.webapp.TestRMWebServicesApps.verifyAppAttemptsInfo(TestRMWebServicesApps.java:1590)
	at org.apache.hadoop.yarn.server.resourcemanager.webapp.TestRMWebServicesApps.testAppAttemptsHelper(TestRMWebServicesApps.java:1534)
	at org.apache.hadoop.yarn.server.resourcemanager.webapp.TestRMWebServicesApps.testAppAttemtpsDefault(TestRMWebServicesApps.java:1437)


REGRESSION:  org.apache.hadoop.yarn.server.resourcemanager.webapp.TestRMWebServicesApps.testAppAttemptsXML

Error Message:
logsLink doesn't match

Stack Trace:
java.lang.AssertionError: logsLink doesn't match
	at org.junit.Assert.fail(Assert.java:93)
	at org.junit.Assert.assertTrue(Assert.java:43)
	at org.apache.hadoop.yarn.server.resourcemanager.webapp.TestRMWebServicesApps.verifyAppAttemptInfoGeneric(TestRMWebServicesApps.java:1611)
	at org.apache.hadoop.yarn.server.resourcemanager.webapp.TestRMWebServicesApps.verifyAppAttemptsXML(TestRMWebServicesApps.java:1574)
	at org.apache.hadoop.yarn.server.resourcemanager.webapp.TestRMWebServicesApps.testAppAttemptsXML(TestRMWebServicesApps.java:1563)



Mime
  • Unnamed multipart/mixed (inline, None, 0 bytes)
View raw message