hadoop-yarn-dev mailing list archives

Site index · List index
Message view « Date » · « Thread »
Top « Date » · « Thread »
From Apache Jenkins Server <jenk...@builds.apache.org>
Subject Build failed in Jenkins: Hadoop-Yarn-trunk #447
Date Thu, 09 Jan 2014 11:00:17 GMT
See <https://builds.apache.org/job/Hadoop-Yarn-trunk/447/changes>

Changes:

[kasha] HADOOP-10214. Fix multithreaded correctness warnings in ActiveStandbyElector (Liang
Xie via kasha)

[cmccabe] HADOOP-10207. TestUserGroupInformation#testLogin is flaky (jxiang via cmccabe)

[jing9] HADOOP-10208. Remove duplicate initialization in StringUtils.getStringCollection.
Contributed by Benoy Antony.

------------------------------------------
[...truncated 14064 lines...]
[INFO] Building jar: <https://builds.apache.org/job/Hadoop-Yarn-trunk/ws/trunk/hadoop-yarn-project/hadoop-yarn/hadoop-yarn-server/hadoop-yarn-server-web-proxy/target/hadoop-yarn-server-web-proxy-3.0.0-SNAPSHOT-javadoc.jar>
[INFO] 
[INFO] --- maven-enforcer-plugin:1.3.1:enforce (depcheck) @ hadoop-yarn-server-web-proxy ---
[INFO] 
[INFO] --- maven-checkstyle-plugin:2.6:checkstyle (default-cli) @ hadoop-yarn-server-web-proxy
---
[INFO] 
[INFO] There are 382 checkstyle errors.
[WARNING] Unable to locate Source XRef to link to - DISABLED
[INFO] 
[INFO] --- findbugs-maven-plugin:2.3.2:findbugs (default-cli) @ hadoop-yarn-server-web-proxy
---
[INFO] ****** FindBugsMojo execute *******
[INFO] canGenerate is true
[INFO] ****** FindBugsMojo executeFindbugs *******
[INFO] Temp File is <https://builds.apache.org/job/Hadoop-Yarn-trunk/ws/trunk/hadoop-yarn-project/hadoop-yarn/hadoop-yarn-server/hadoop-yarn-server-web-proxy/target/findbugsTemp.xml>
[INFO] Fork Value is true
[INFO] xmlOutput is true
[INFO]                                                                         
[INFO] ------------------------------------------------------------------------
[INFO] Building hadoop-yarn-server-resourcemanager 3.0.0-SNAPSHOT
[INFO] ------------------------------------------------------------------------
[WARNING] The POM for org.eclipse.m2e:lifecycle-mapping:jar:1.0.0 is missing, no dependency
information available
[WARNING] Failed to retrieve plugin descriptor for org.eclipse.m2e:lifecycle-mapping:1.0.0:
Plugin org.eclipse.m2e:lifecycle-mapping:1.0.0 or one of its dependencies could not be resolved:
Failed to read artifact descriptor for org.eclipse.m2e:lifecycle-mapping:jar:1.0.0
[INFO] 
[INFO] --- maven-clean-plugin:2.4.1:clean (default-clean) @ hadoop-yarn-server-resourcemanager
---
[INFO] Deleting <https://builds.apache.org/job/Hadoop-Yarn-trunk/ws/trunk/hadoop-yarn-project/hadoop-yarn/hadoop-yarn-server/hadoop-yarn-server-resourcemanager/target>
[INFO] 
[INFO] --- maven-antrun-plugin:1.7:run (create-testdirs) @ hadoop-yarn-server-resourcemanager
---
[INFO] Executing tasks

main:
    [mkdir] Created dir: <https://builds.apache.org/job/Hadoop-Yarn-trunk/ws/trunk/hadoop-yarn-project/hadoop-yarn/hadoop-yarn-server/hadoop-yarn-server-resourcemanager/target/test-dir>
[INFO] Executed tasks
[INFO] 
[INFO] --- maven-resources-plugin:2.2:resources (default-resources) @ hadoop-yarn-server-resourcemanager
---
[INFO] Using default encoding to copy filtered resources.
[INFO] 
[INFO] --- maven-compiler-plugin:2.5.1:compile (default-compile) @ hadoop-yarn-server-resourcemanager
---
[INFO] Compiling 219 source files to <https://builds.apache.org/job/Hadoop-Yarn-trunk/ws/trunk/hadoop-yarn-project/hadoop-yarn/hadoop-yarn-server/hadoop-yarn-server-resourcemanager/target/classes>
[INFO] 
[INFO] --- maven-resources-plugin:2.2:testResources (default-testResources) @ hadoop-yarn-server-resourcemanager
---
[INFO] Using default encoding to copy filtered resources.
[INFO] 
[INFO] --- maven-compiler-plugin:2.5.1:testCompile (default-testCompile) @ hadoop-yarn-server-resourcemanager
---
[INFO] Compiling 87 source files to <https://builds.apache.org/job/Hadoop-Yarn-trunk/ws/trunk/hadoop-yarn-project/hadoop-yarn/hadoop-yarn-server/hadoop-yarn-server-resourcemanager/target/test-classes>
[INFO] 
[INFO] --- maven-jar-plugin:2.3.1:test-jar (default) @ hadoop-yarn-server-resourcemanager
---
[INFO] Building jar: <https://builds.apache.org/job/Hadoop-Yarn-trunk/ws/trunk/hadoop-yarn-project/hadoop-yarn/hadoop-yarn-server/hadoop-yarn-server-resourcemanager/target/hadoop-yarn-server-resourcemanager-3.0.0-SNAPSHOT-tests.jar>
[INFO] 
[INFO] --- maven-surefire-plugin:2.16:test (default-test) @ hadoop-yarn-server-resourcemanager
---
[INFO] Surefire report directory: <https://builds.apache.org/job/Hadoop-Yarn-trunk/ws/trunk/hadoop-yarn-project/hadoop-yarn/hadoop-yarn-server/hadoop-yarn-server-resourcemanager/target/surefire-reports>

-------------------------------------------------------
 T E S T S
-------------------------------------------------------

-------------------------------------------------------
 T E S T S
-------------------------------------------------------
Running org.apache.hadoop.yarn.server.resourcemanager.TestRM
Tests run: 7, Failures: 0, Errors: 0, Skipped: 0, Time elapsed: 60.257 sec - in org.apache.hadoop.yarn.server.resourcemanager.TestRM
Running org.apache.hadoop.yarn.server.resourcemanager.recovery.TestZKRMStateStoreZKClientConnections
Tests run: 5, Failures: 1, Errors: 0, Skipped: 0, Time elapsed: 3.332 sec <<< FAILURE!
- in org.apache.hadoop.yarn.server.resourcemanager.recovery.TestZKRMStateStoreZKClientConnections
testZKClientDisconnectAndReconnect(org.apache.hadoop.yarn.server.resourcemanager.recovery.TestZKRMStateStoreZKClientConnections)
 Time elapsed: 0.2 sec  <<< FAILURE!
java.lang.AssertionError: Unable to connect to server
	at org.junit.Assert.fail(Assert.java:93)
	at org.apache.hadoop.ha.ClientBaseWithFixes.createClient(ClientBaseWithFixes.java:180)
	at org.apache.hadoop.yarn.server.resourcemanager.recovery.TestZKRMStateStoreZKClientConnections.access$100(TestZKRMStateStoreZKClientConnections.java:45)

Running org.apache.hadoop.yarn.server.resourcemanager.recovery.TestFSRMStateStore
Tests run: 2, Failures: 0, Errors: 0, Skipped: 0, Time elapsed: 18.878 sec - in org.apache.hadoop.yarn.server.resourcemanager.recovery.TestFSRMStateStore
Running org.apache.hadoop.yarn.server.resourcemanager.recovery.TestZKRMStateStore
Tests run: 2, Failures: 0, Errors: 0, Skipped: 0, Time elapsed: 7.547 sec - in org.apache.hadoop.yarn.server.resourcemanager.recovery.TestZKRMStateStore
Running org.apache.hadoop.yarn.server.resourcemanager.TestApplicationACLs
Tests run: 1, Failures: 0, Errors: 0, Skipped: 0, Time elapsed: 17.624 sec - in org.apache.hadoop.yarn.server.resourcemanager.TestApplicationACLs
Running org.apache.hadoop.yarn.server.resourcemanager.resource.TestResources
Tests run: 2, Failures: 0, Errors: 0, Skipped: 0, Time elapsed: 0.301 sec - in org.apache.hadoop.yarn.server.resourcemanager.resource.TestResources
Running org.apache.hadoop.yarn.server.resourcemanager.resource.TestResourceWeights
Tests run: 1, Failures: 0, Errors: 0, Skipped: 0, Time elapsed: 0.064 sec - in org.apache.hadoop.yarn.server.resourcemanager.resource.TestResourceWeights
Running org.apache.hadoop.yarn.server.resourcemanager.TestRMHA
Tests run: 2, Failures: 0, Errors: 0, Skipped: 0, Time elapsed: 9.614 sec - in org.apache.hadoop.yarn.server.resourcemanager.TestRMHA
Running org.apache.hadoop.yarn.server.resourcemanager.monitor.capacity.TestProportionalCapacityPreemptionPolicy
Tests run: 11, Failures: 0, Errors: 0, Skipped: 0, Time elapsed: 3.779 sec - in org.apache.hadoop.yarn.server.resourcemanager.monitor.capacity.TestProportionalCapacityPreemptionPolicy
Running org.apache.hadoop.yarn.server.resourcemanager.monitor.TestSchedulingMonitor
Tests run: 1, Failures: 0, Errors: 0, Skipped: 0, Time elapsed: 1.25 sec - in org.apache.hadoop.yarn.server.resourcemanager.monitor.TestSchedulingMonitor
Running org.apache.hadoop.yarn.server.resourcemanager.TestApplicationCleanup
Tests run: 2, Failures: 0, Errors: 0, Skipped: 0, Time elapsed: 10.959 sec - in org.apache.hadoop.yarn.server.resourcemanager.TestApplicationCleanup
Running org.apache.hadoop.yarn.server.resourcemanager.TestResourceTrackerService
Tests run: 13, Failures: 0, Errors: 0, Skipped: 0, Time elapsed: 3.165 sec - in org.apache.hadoop.yarn.server.resourcemanager.TestResourceTrackerService
Running org.apache.hadoop.yarn.server.resourcemanager.TestRMNodeTransitions
Tests run: 13, Failures: 0, Errors: 0, Skipped: 0, Time elapsed: 1.325 sec - in org.apache.hadoop.yarn.server.resourcemanager.TestRMNodeTransitions
Running org.apache.hadoop.yarn.server.resourcemanager.TestAppManager
Tests run: 11, Failures: 0, Errors: 0, Skipped: 0, Time elapsed: 6.958 sec - in org.apache.hadoop.yarn.server.resourcemanager.TestAppManager
Running org.apache.hadoop.yarn.server.resourcemanager.applicationsmanager.TestAMRMRPCResponseId
Tests run: 1, Failures: 0, Errors: 0, Skipped: 0, Time elapsed: 5.535 sec - in org.apache.hadoop.yarn.server.resourcemanager.applicationsmanager.TestAMRMRPCResponseId
Running org.apache.hadoop.yarn.server.resourcemanager.applicationsmanager.TestAMRMRPCNodeUpdates
Tests run: 1, Failures: 0, Errors: 0, Skipped: 0, Time elapsed: 9.573 sec - in org.apache.hadoop.yarn.server.resourcemanager.applicationsmanager.TestAMRMRPCNodeUpdates
Running org.apache.hadoop.yarn.server.resourcemanager.TestRMRestart
Tests run: 17, Failures: 0, Errors: 0, Skipped: 0, Time elapsed: 167.175 sec - in org.apache.hadoop.yarn.server.resourcemanager.TestRMRestart
Running org.apache.hadoop.yarn.server.resourcemanager.TestApplicationMasterLauncher
Tests run: 2, Failures: 0, Errors: 0, Skipped: 0, Time elapsed: 8.665 sec - in org.apache.hadoop.yarn.server.resourcemanager.TestApplicationMasterLauncher
Running org.apache.hadoop.yarn.server.resourcemanager.security.TestRMDelegationTokens
Tests run: 2, Failures: 0, Errors: 0, Skipped: 0, Time elapsed: 6.491 sec - in org.apache.hadoop.yarn.server.resourcemanager.security.TestRMDelegationTokens
Running org.apache.hadoop.yarn.server.resourcemanager.security.TestDelegationTokenRenewer
Tests run: 7, Failures: 0, Errors: 0, Skipped: 0, Time elapsed: 36.438 sec - in org.apache.hadoop.yarn.server.resourcemanager.security.TestDelegationTokenRenewer
Running org.apache.hadoop.yarn.server.resourcemanager.security.TestDelegationTokenRenewerLifecycle
Tests run: 1, Failures: 0, Errors: 0, Skipped: 0, Time elapsed: 0.287 sec - in org.apache.hadoop.yarn.server.resourcemanager.security.TestDelegationTokenRenewerLifecycle
Running org.apache.hadoop.yarn.server.resourcemanager.security.TestAMRMTokens
Tests run: 4, Failures: 0, Errors: 0, Skipped: 0, Time elapsed: 15.152 sec - in org.apache.hadoop.yarn.server.resourcemanager.security.TestAMRMTokens
Running org.apache.hadoop.yarn.server.resourcemanager.security.TestClientToAMTokens
Tests run: 1, Failures: 0, Errors: 0, Skipped: 0, Time elapsed: 5.044 sec - in org.apache.hadoop.yarn.server.resourcemanager.security.TestClientToAMTokens
Running org.apache.hadoop.yarn.server.resourcemanager.applicationmasterservice.TestApplicationMasterService
Tests run: 2, Failures: 0, Errors: 0, Skipped: 0, Time elapsed: 15.555 sec - in org.apache.hadoop.yarn.server.resourcemanager.applicationmasterservice.TestApplicationMasterService
Running org.apache.hadoop.yarn.server.resourcemanager.rmcontainer.TestRMContainerImpl
Tests run: 2, Failures: 0, Errors: 0, Skipped: 0, Time elapsed: 0.782 sec - in org.apache.hadoop.yarn.server.resourcemanager.rmcontainer.TestRMContainerImpl
Running org.apache.hadoop.yarn.server.resourcemanager.TestClientRMService
Tests run: 10, Failures: 0, Errors: 0, Skipped: 0, Time elapsed: 2.434 sec - in org.apache.hadoop.yarn.server.resourcemanager.TestClientRMService
Running org.apache.hadoop.yarn.server.resourcemanager.scheduler.fair.TestFSLeafQueue
Tests run: 1, Failures: 0, Errors: 0, Skipped: 0, Time elapsed: 1.426 sec - in org.apache.hadoop.yarn.server.resourcemanager.scheduler.fair.TestFSLeafQueue
Running org.apache.hadoop.yarn.server.resourcemanager.scheduler.fair.TestQueuePlacementPolicy
Tests run: 5, Failures: 0, Errors: 0, Skipped: 0, Time elapsed: 0.347 sec - in org.apache.hadoop.yarn.server.resourcemanager.scheduler.fair.TestQueuePlacementPolicy
Running org.apache.hadoop.yarn.server.resourcemanager.scheduler.fair.policies.TestDominantResourceFairnessPolicy
Tests run: 9, Failures: 0, Errors: 0, Skipped: 0, Time elapsed: 0.331 sec - in org.apache.hadoop.yarn.server.resourcemanager.scheduler.fair.policies.TestDominantResourceFairnessPolicy
Running org.apache.hadoop.yarn.server.resourcemanager.scheduler.fair.policies.TestEmptyQueues
Tests run: 3, Failures: 0, Errors: 0, Skipped: 0, Time elapsed: 0.16 sec - in org.apache.hadoop.yarn.server.resourcemanager.scheduler.fair.policies.TestEmptyQueues
Running org.apache.hadoop.yarn.server.resourcemanager.scheduler.fair.TestAllocationFileLoaderService
Tests run: 6, Failures: 0, Errors: 0, Skipped: 0, Time elapsed: 0.626 sec - in org.apache.hadoop.yarn.server.resourcemanager.scheduler.fair.TestAllocationFileLoaderService
Running org.apache.hadoop.yarn.server.resourcemanager.scheduler.fair.TestFSSchedulerApp
Tests run: 3, Failures: 0, Errors: 0, Skipped: 0, Time elapsed: 0.548 sec - in org.apache.hadoop.yarn.server.resourcemanager.scheduler.fair.TestFSSchedulerApp
Running org.apache.hadoop.yarn.server.resourcemanager.scheduler.fair.TestSchedulingPolicy
Tests run: 2, Failures: 0, Errors: 0, Skipped: 0, Time elapsed: 0.326 sec - in org.apache.hadoop.yarn.server.resourcemanager.scheduler.fair.TestSchedulingPolicy
Running org.apache.hadoop.yarn.server.resourcemanager.scheduler.fair.TestFairSchedulerEventLog
Tests run: 1, Failures: 0, Errors: 0, Skipped: 0, Time elapsed: 1.275 sec - in org.apache.hadoop.yarn.server.resourcemanager.scheduler.fair.TestFairSchedulerEventLog
Running org.apache.hadoop.yarn.server.resourcemanager.scheduler.fair.TestComputeFairShares
Tests run: 9, Failures: 0, Errors: 0, Skipped: 0, Time elapsed: 0.32 sec - in org.apache.hadoop.yarn.server.resourcemanager.scheduler.fair.TestComputeFairShares
Running org.apache.hadoop.yarn.server.resourcemanager.scheduler.fair.TestFairSchedulerConfiguration
Tests run: 5, Failures: 0, Errors: 0, Skipped: 0, Time elapsed: 0.307 sec - in org.apache.hadoop.yarn.server.resourcemanager.scheduler.fair.TestFairSchedulerConfiguration
Running org.apache.hadoop.yarn.server.resourcemanager.scheduler.fair.TestFairSchedulerQueueACLs
Tests run: 1, Failures: 0, Errors: 0, Skipped: 0, Time elapsed: 49.868 sec - in org.apache.hadoop.yarn.server.resourcemanager.scheduler.fair.TestFairSchedulerQueueACLs
Running org.apache.hadoop.yarn.server.resourcemanager.scheduler.fair.TestFairScheduler
Tests run: 52, Failures: 0, Errors: 0, Skipped: 0, Time elapsed: 6.627 sec - in org.apache.hadoop.yarn.server.resourcemanager.scheduler.fair.TestFairScheduler
Running org.apache.hadoop.yarn.server.resourcemanager.scheduler.fair.TestMaxRunningAppsEnforcer
Tests run: 4, Failures: 0, Errors: 0, Skipped: 0, Time elapsed: 0.968 sec - in org.apache.hadoop.yarn.server.resourcemanager.scheduler.fair.TestMaxRunningAppsEnforcer
Running org.apache.hadoop.yarn.server.resourcemanager.scheduler.capacity.TestCapacitySchedulerQueueACLs
Tests run: 1, Failures: 0, Errors: 0, Skipped: 0, Time elapsed: 51.924 sec - in org.apache.hadoop.yarn.server.resourcemanager.scheduler.capacity.TestCapacitySchedulerQueueACLs
Running org.apache.hadoop.yarn.server.resourcemanager.scheduler.capacity.TestChildQueueOrder
Tests run: 1, Failures: 0, Errors: 0, Skipped: 0, Time elapsed: 2.119 sec - in org.apache.hadoop.yarn.server.resourcemanager.scheduler.capacity.TestChildQueueOrder
Running org.apache.hadoop.yarn.server.resourcemanager.scheduler.capacity.TestLeafQueue
Tests run: 20, Failures: 0, Errors: 0, Skipped: 0, Time elapsed: 6.535 sec - in org.apache.hadoop.yarn.server.resourcemanager.scheduler.capacity.TestLeafQueue
Running org.apache.hadoop.yarn.server.resourcemanager.scheduler.capacity.TestQueueParsing
Tests run: 2, Failures: 0, Errors: 0, Skipped: 0, Time elapsed: 1.089 sec - in org.apache.hadoop.yarn.server.resourcemanager.scheduler.capacity.TestQueueParsing
Running org.apache.hadoop.yarn.server.resourcemanager.scheduler.capacity.TestParentQueue
Tests run: 9, Failures: 0, Errors: 0, Skipped: 0, Time elapsed: 3.276 sec - in org.apache.hadoop.yarn.server.resourcemanager.scheduler.capacity.TestParentQueue
Running org.apache.hadoop.yarn.server.resourcemanager.scheduler.capacity.TestApplicationLimits
Tests run: 4, Failures: 0, Errors: 0, Skipped: 0, Time elapsed: 2.041 sec - in org.apache.hadoop.yarn.server.resourcemanager.scheduler.capacity.TestApplicationLimits
Running org.apache.hadoop.yarn.server.resourcemanager.scheduler.capacity.TestCapacityScheduler
Tests run: 13, Failures: 0, Errors: 0, Skipped: 0, Time elapsed: 4.618 sec - in org.apache.hadoop.yarn.server.resourcemanager.scheduler.capacity.TestCapacityScheduler
Running org.apache.hadoop.yarn.server.resourcemanager.scheduler.capacity.TestContainerAllocation
Tests run: 1, Failures: 0, Errors: 0, Skipped: 0, Time elapsed: 16.045 sec - in org.apache.hadoop.yarn.server.resourcemanager.scheduler.capacity.TestContainerAllocation
Running org.apache.hadoop.yarn.server.resourcemanager.scheduler.TestSchedulerUtils
Tests run: 7, Failures: 0, Errors: 0, Skipped: 0, Time elapsed: 5.057 sec - in org.apache.hadoop.yarn.server.resourcemanager.scheduler.TestSchedulerUtils
Running org.apache.hadoop.yarn.server.resourcemanager.scheduler.fifo.TestFifoScheduler
Tests run: 8, Failures: 0, Errors: 0, Skipped: 0, Time elapsed: 3.468 sec - in org.apache.hadoop.yarn.server.resourcemanager.scheduler.fifo.TestFifoScheduler
Running org.apache.hadoop.yarn.server.resourcemanager.scheduler.TestQueueMetrics
Tests run: 7, Failures: 0, Errors: 0, Skipped: 0, Time elapsed: 2.058 sec - in org.apache.hadoop.yarn.server.resourcemanager.scheduler.TestQueueMetrics
Running org.apache.hadoop.yarn.server.resourcemanager.TestAMAuthorization
Tests run: 4, Failures: 0, Errors: 0, Skipped: 0, Time elapsed: 14.412 sec - in org.apache.hadoop.yarn.server.resourcemanager.TestAMAuthorization
Running org.apache.hadoop.yarn.server.resourcemanager.TestResourceManager
Tests run: 4, Failures: 0, Errors: 0, Skipped: 0, Time elapsed: 1.861 sec - in org.apache.hadoop.yarn.server.resourcemanager.TestResourceManager
Running org.apache.hadoop.yarn.server.resourcemanager.rmapp.attempt.TestRMAppAttemptTransitions
Tests run: 54, Failures: 0, Errors: 0, Skipped: 1, Time elapsed: 3.958 sec - in org.apache.hadoop.yarn.server.resourcemanager.rmapp.attempt.TestRMAppAttemptTransitions
Running org.apache.hadoop.yarn.server.resourcemanager.rmapp.TestRMAppTransitions
Tests run: 38, Failures: 0, Errors: 0, Skipped: 0, Time elapsed: 2.533 sec - in org.apache.hadoop.yarn.server.resourcemanager.rmapp.TestRMAppTransitions
Running org.apache.hadoop.yarn.server.resourcemanager.resourcetracker.TestNMExpiry
Tests run: 1, Failures: 0, Errors: 0, Skipped: 0, Time elapsed: 2.552 sec - in org.apache.hadoop.yarn.server.resourcemanager.resourcetracker.TestNMExpiry
Running org.apache.hadoop.yarn.server.resourcemanager.resourcetracker.TestRMNMRPCResponseId
Tests run: 1, Failures: 0, Errors: 0, Skipped: 0, Time elapsed: 1.151 sec - in org.apache.hadoop.yarn.server.resourcemanager.resourcetracker.TestRMNMRPCResponseId
Running org.apache.hadoop.yarn.server.resourcemanager.resourcetracker.TestNMReconnect
Tests run: 1, Failures: 0, Errors: 0, Skipped: 0, Time elapsed: 1.143 sec - in org.apache.hadoop.yarn.server.resourcemanager.resourcetracker.TestNMReconnect
Running org.apache.hadoop.yarn.server.resourcemanager.TestClientRMTokens
Tests run: 6, Failures: 0, Errors: 0, Skipped: 0, Time elapsed: 16.938 sec - in org.apache.hadoop.yarn.server.resourcemanager.TestClientRMTokens
Running org.apache.hadoop.yarn.server.resourcemanager.webapp.TestRMWebServicesCapacitySched
Tests run: 7, Failures: 0, Errors: 0, Skipped: 0, Time elapsed: 13.987 sec - in org.apache.hadoop.yarn.server.resourcemanager.webapp.TestRMWebServicesCapacitySched
Running org.apache.hadoop.yarn.server.resourcemanager.webapp.TestRMWebServices
Tests run: 18, Failures: 0, Errors: 0, Skipped: 0, Time elapsed: 8.776 sec - in org.apache.hadoop.yarn.server.resourcemanager.webapp.TestRMWebServices
Running org.apache.hadoop.yarn.server.resourcemanager.webapp.TestRMWebApp
Tests run: 3, Failures: 0, Errors: 0, Skipped: 0, Time elapsed: 8.642 sec - in org.apache.hadoop.yarn.server.resourcemanager.webapp.TestRMWebApp
Running org.apache.hadoop.yarn.server.resourcemanager.webapp.TestNodesPage
Tests run: 2, Failures: 0, Errors: 0, Skipped: 0, Time elapsed: 3.232 sec - in org.apache.hadoop.yarn.server.resourcemanager.webapp.TestNodesPage
Running org.apache.hadoop.yarn.server.resourcemanager.webapp.TestRMWebServicesNodes
Tests run: 22, Failures: 0, Errors: 0, Skipped: 0, Time elapsed: 10.189 sec - in org.apache.hadoop.yarn.server.resourcemanager.webapp.TestRMWebServicesNodes
Running org.apache.hadoop.yarn.server.resourcemanager.webapp.TestRMWebServicesFairScheduler
Tests run: 2, Failures: 0, Errors: 0, Skipped: 0, Time elapsed: 3.808 sec - in org.apache.hadoop.yarn.server.resourcemanager.webapp.TestRMWebServicesFairScheduler
Running org.apache.hadoop.yarn.server.resourcemanager.webapp.TestRMWebServicesApps
Tests run: 40, Failures: 0, Errors: 0, Skipped: 0, Time elapsed: 165.24 sec - in org.apache.hadoop.yarn.server.resourcemanager.webapp.TestRMWebServicesApps
Running org.apache.hadoop.yarn.server.resourcemanager.TestFifoScheduler
Tests run: 7, Failures: 0, Errors: 0, Skipped: 0, Time elapsed: 20.85 sec - in org.apache.hadoop.yarn.server.resourcemanager.TestFifoScheduler
Running org.apache.hadoop.yarn.server.resourcemanager.TestRMAuditLogger
Tests run: 3, Failures: 0, Errors: 0, Skipped: 0, Time elapsed: 0.905 sec - in org.apache.hadoop.yarn.server.resourcemanager.TestRMAuditLogger

Results :

Failed tests: 
  TestZKRMStateStoreZKClientConnections.testZKClientDisconnectAndReconnect:157->access$100:45->ClientBaseWithFixes.createClient:180
Unable to connect to server

Tests run: 510, Failures: 1, Errors: 0, Skipped: 1

[INFO] ------------------------------------------------------------------------
[INFO] Reactor Summary:
[INFO] 
[INFO] hadoop-yarn ....................................... SUCCESS [10.145s]
[INFO] hadoop-yarn-api ................................... SUCCESS [2:44.539s]
[INFO] hadoop-yarn-common ................................ SUCCESS [2:23.228s]
[INFO] hadoop-yarn-server ................................ SUCCESS [0.268s]
[INFO] hadoop-yarn-server-common ......................... SUCCESS [33.573s]
[INFO] hadoop-yarn-server-nodemanager .................... SUCCESS [4:50.355s]
[INFO] hadoop-yarn-server-web-proxy ...................... SUCCESS [19.077s]
[INFO] hadoop-yarn-server-resourcemanager ................ FAILURE [14:39.784s]
[INFO] hadoop-yarn-server-tests .......................... SKIPPED
[INFO] hadoop-yarn-client ................................ SKIPPED
[INFO] hadoop-yarn-applications .......................... SKIPPED
[INFO] hadoop-yarn-applications-distributedshell ......... SKIPPED
[INFO] hadoop-yarn-applications-unmanaged-am-launcher .... SKIPPED
[INFO] hadoop-yarn-site .................................. SKIPPED
[INFO] hadoop-yarn-project ............................... SKIPPED
[INFO] ------------------------------------------------------------------------
[INFO] BUILD FAILURE
[INFO] ------------------------------------------------------------------------
[INFO] Total time: 25:43.860s
[INFO] Finished at: Thu Jan 09 11:00:09 UTC 2014
[INFO] Final Memory: 47M/768M
[INFO] ------------------------------------------------------------------------
[ERROR] Failed to execute goal org.apache.maven.plugins:maven-surefire-plugin:2.16:test (default-test)
on project hadoop-yarn-server-resourcemanager: There are test failures.
[ERROR] 
[ERROR] Please refer to <https://builds.apache.org/job/Hadoop-Yarn-trunk/ws/trunk/hadoop-yarn-project/hadoop-yarn/hadoop-yarn-server/hadoop-yarn-server-resourcemanager/target/surefire-reports>
for the individual test results.
[ERROR] -> [Help 1]
[ERROR] 
[ERROR] To see the full stack trace of the errors, re-run Maven with the -e switch.
[ERROR] Re-run Maven using the -X switch to enable full debug logging.
[ERROR] 
[ERROR] For more information about the errors and possible solutions, please read the following
articles:
[ERROR] [Help 1] http://cwiki.apache.org/confluence/display/MAVEN/MojoFailureException
[ERROR] 
[ERROR] After correcting the problems, you can resume the build with the command
[ERROR]   mvn <goals> -rf :hadoop-yarn-server-resourcemanager
Build step 'Execute shell' marked build as failure
Archiving artifacts
Updating HADOOP-10214
Updating HADOOP-10207
Updating HADOOP-10208

Mime
View raw message