hadoop-yarn-dev mailing list archives

Site index · List index
Message view « Date » · « Thread »
Top « Date » · « Thread »
From Apache Jenkins Server <jenk...@builds.apache.org>
Subject Hadoop-Yarn-trunk - Build # 464 - Failure
Date Tue, 28 Jan 2014 11:09:07 GMT
See https://builds.apache.org/job/Hadoop-Yarn-trunk/464/

###################################################################################
########################## LAST 60 LINES OF THE CONSOLE ###########################
[...truncated 15706 lines...]
[INFO] ------------------------------------------------------------------------
[INFO] Reactor Summary:
[INFO] 
[INFO] hadoop-yarn ....................................... SUCCESS [2.668s]
[INFO] hadoop-yarn-api ................................... SUCCESS [3:08.708s]
[INFO] hadoop-yarn-common ................................ SUCCESS [2:06.762s]
[INFO] hadoop-yarn-server ................................ SUCCESS [0.069s]
[INFO] hadoop-yarn-server-common ......................... SUCCESS [34.006s]
[INFO] hadoop-yarn-server-nodemanager .................... SUCCESS [4:31.822s]
[INFO] hadoop-yarn-server-web-proxy ...................... SUCCESS [19.474s]
[INFO] hadoop-yarn-server-applicationhistoryservice ...... SUCCESS [58.752s]
[INFO] hadoop-yarn-server-resourcemanager ................ SUCCESS [17:22.030s]
[INFO] hadoop-yarn-server-tests .......................... SUCCESS [1:20.227s]
[INFO] hadoop-yarn-client ................................ FAILURE [3:31.596s]
[INFO] hadoop-yarn-applications .......................... SKIPPED
[INFO] hadoop-yarn-applications-distributedshell ......... SKIPPED
[INFO] hadoop-yarn-applications-unmanaged-am-launcher .... SKIPPED
[INFO] hadoop-yarn-site .................................. SKIPPED
[INFO] hadoop-yarn-project ............................... SKIPPED
[INFO] ------------------------------------------------------------------------
[INFO] BUILD FAILURE
[INFO] ------------------------------------------------------------------------
[INFO] Total time: 33:58.161s
[INFO] Finished at: Tue Jan 28 11:08:58 UTC 2014
[INFO] Final Memory: 60M/735M
[INFO] ------------------------------------------------------------------------
[ERROR] Failed to execute goal org.apache.maven.plugins:maven-surefire-plugin:2.16:test (default-test)
on project hadoop-yarn-client: ExecutionException; nested exception is java.util.concurrent.ExecutionException:
java.lang.RuntimeException: The forked VM terminated without saying properly goodbye. VM crash
or System.exit called ?
[ERROR] Command was/bin/sh -c cd /home/jenkins/jenkins-slave/workspace/Hadoop-Yarn-trunk/trunk/hadoop-yarn-project/hadoop-yarn/hadoop-yarn-client
&& /home/jenkins/tools/java/jdk1.6.0_27/jre/bin/java -Xmx1024m -XX:+HeapDumpOnOutOfMemoryError
-jar /home/jenkins/jenkins-slave/workspace/Hadoop-Yarn-trunk/trunk/hadoop-yarn-project/hadoop-yarn/hadoop-yarn-client/target/surefire/surefirebooter6655790146546526197.jar
/home/jenkins/jenkins-slave/workspace/Hadoop-Yarn-trunk/trunk/hadoop-yarn-project/hadoop-yarn/hadoop-yarn-client/target/surefire/surefire2941875037475283827tmp
/home/jenkins/jenkins-slave/workspace/Hadoop-Yarn-trunk/trunk/hadoop-yarn-project/hadoop-yarn/hadoop-yarn-client/target/surefire/surefire_1861898724086410134624tmp
[ERROR] -> [Help 1]
[ERROR] 
[ERROR] To see the full stack trace of the errors, re-run Maven with the -e switch.
[ERROR] Re-run Maven using the -X switch to enable full debug logging.
[ERROR] 
[ERROR] For more information about the errors and possible solutions, please read the following
articles:
[ERROR] [Help 1] http://cwiki.apache.org/confluence/display/MAVEN/MojoFailureException
[ERROR] 
[ERROR] After correcting the problems, you can resume the build with the command
[ERROR]   mvn <goals> -rf :hadoop-yarn-client
Build step 'Execute shell' marked build as failure
Archiving artifacts
Updating HADOOP-9982
Updating HDFS-5297
Updating HADOOP-9830
Updating HDFS-5825
Updating YARN-1642
Updating HDFS-5781
Updating HDFS-5833
Updating HDFS-5830
Updating HADOOP-10274
Updating HADOOP-10203
Updating YARN-1629
Updating HADOOP-10255
Updating HADOOP-10212
Updating HADOOP-10250
Updating HADOOP-10086
Updating HADOOP-10288
Sending e-mails to: yarn-dev@hadoop.apache.org
Email was triggered for: Failure
Sending email for trigger: Failure



###################################################################################
############################## FAILED TESTS (if any) ##############################
No tests ran.
Mime
  • Unnamed multipart/mixed (inline, None, 0 bytes)
View raw message