hadoop-yarn-dev mailing list archives

Site index · List index
Message view « Date » · « Thread »
Top « Date » · « Thread »
From Apache Jenkins Server <jenk...@builds.apache.org>
Subject Failed: YARN-1363 PreCommit Build #2659
Date Sat, 14 Dec 2013 01:49:35 GMT
Jira: https://issues.apache.org/jira/browse/YARN-1363
Build: https://builds.apache.org/job/PreCommit-YARN-Build/2659/

###################################################################################
########################## LAST 60 LINES OF THE CONSOLE ###########################
[...truncated 4893 lines...]
NOP




{color:red}-1 overall{color}.  Here are the results of testing the latest attachment 
  http://issues.apache.org/jira/secure/attachment/12618719/YARN-1363.4.patch
  against trunk revision .

    {color:green}+1 @author{color}.  The patch does not contain any @author tags.

    {color:green}+1 tests included{color}.  The patch appears to include 7 new or modified
test files.

    {color:green}+1 javac{color}.  The applied patch does not increase the total number of
javac compiler warnings.

    {color:green}+1 javadoc{color}.  The javadoc tool did not generate any warning messages.

    {color:green}+1 eclipse:eclipse{color}.  The patch built with eclipse:eclipse.

    {color:green}+1 findbugs{color}.  The patch does not introduce any new Findbugs (version
1.3.9) warnings.

    {color:green}+1 release audit{color}.  The applied patch does not increase the total number
of release audit warnings.

    {color:red}-1 core tests{color}.  The patch failed these unit tests in hadoop-common-project/hadoop-common
hadoop-mapreduce-project/hadoop-mapreduce-client/hadoop-mapreduce-client-jobclient hadoop-yarn-project/hadoop-yarn/hadoop-yarn-api
hadoop-yarn-project/hadoop-yarn/hadoop-yarn-client hadoop-yarn-project/hadoop-yarn/hadoop-yarn-common
hadoop-yarn-project/hadoop-yarn/hadoop-yarn-server/hadoop-yarn-server-resourcemanager:

                  org.apache.hadoop.mapreduce.security.TestJHSSecurity

    {color:green}+1 contrib tests{color}.  The patch passed contrib unit tests.

Test results: https://builds.apache.org/job/PreCommit-YARN-Build/2659//testReport/
Console output: https://builds.apache.org/job/PreCommit-YARN-Build/2659//console

This message is automatically generated.


======================================================================
======================================================================
    Adding comment to Jira.
======================================================================
======================================================================


Comment added.
7f6b8495c15e06291b55291262aa1d8b2aa09a68 logged out


======================================================================
======================================================================
    Finished build.
======================================================================
======================================================================


Build step 'Execute shell' marked build as failure
Archiving artifacts
[description-setter] Could not determine description.
Recording test results
Email was triggered for: Failure
Sending email for trigger: Failure



###################################################################################
############################## FAILED TESTS (if any) ##############################
1 tests failed.
FAILED:  org.apache.hadoop.mapreduce.security.TestJHSSecurity.testDelegationToken

Error Message:
null

Stack Trace:
java.lang.NullPointerException: null
	at java.util.Hashtable.get(Hashtable.java:334)
	at java.util.Properties.getProperty(Properties.java:932)
	at org.apache.hadoop.conf.Configuration.get(Configuration.java:874)
	at org.apache.hadoop.http.HttpServer.initSpnego(HttpServer.java:892)
	at org.apache.hadoop.http.HttpServer.access$100(HttpServer.java:101)
	at org.apache.hadoop.http.HttpServer$Builder.build(HttpServer.java:323)
	at org.apache.hadoop.yarn.webapp.WebApps$Builder.start(WebApps.java:232)
	at org.apache.hadoop.mapreduce.v2.hs.HistoryClientService.initializeWebApp(HistoryClientService.java:149)
	at org.apache.hadoop.mapreduce.v2.hs.HistoryClientService.serviceStart(HistoryClientService.java:118)
	at org.apache.hadoop.service.AbstractService.start(AbstractService.java:193)
	at org.apache.hadoop.service.CompositeService.serviceStart(CompositeService.java:121)
	at org.apache.hadoop.mapreduce.v2.hs.JobHistoryServer.serviceStart(JobHistoryServer.java:175)
	at org.apache.hadoop.service.AbstractService.start(AbstractService.java:193)
	at org.apache.hadoop.mapreduce.security.TestJHSSecurity.testDelegationToken(TestJHSSecurity.java:100)



Mime
  • Unnamed multipart/mixed (inline, None, 0 bytes)
View raw message