hadoop-yarn-dev mailing list archives

Site index · List index
Message view « Date » · « Thread »
Top « Date » · « Thread »
From Apache Jenkins Server <jenk...@builds.apache.org>
Subject Hadoop-Yarn-trunk - Build # 424 - Still Failing
Date Tue, 17 Dec 2013 11:00:26 GMT
See https://builds.apache.org/job/Hadoop-Yarn-trunk/424/

###################################################################################
########################## LAST 60 LINES OF THE CONSOLE ###########################
[...truncated 14928 lines...]
  TestContainerManagerSecurity.testContainerManager:110 ยป YarnRuntime java.io.IO...

Tests run: 7, Failures: 0, Errors: 2, Skipped: 0

[INFO] ------------------------------------------------------------------------
[INFO] Reactor Summary:
[INFO] 
[INFO] hadoop-yarn ....................................... SUCCESS [4.121s]
[INFO] hadoop-yarn-api ................................... SUCCESS [2:30.985s]
[INFO] hadoop-yarn-common ................................ SUCCESS [2:16.695s]
[INFO] hadoop-yarn-server ................................ SUCCESS [0.393s]
[INFO] hadoop-yarn-server-common ......................... SUCCESS [31.887s]
[INFO] hadoop-yarn-server-nodemanager .................... SUCCESS [4:33.597s]
[INFO] hadoop-yarn-server-web-proxy ...................... SUCCESS [16.543s]
[INFO] hadoop-yarn-server-resourcemanager ................ SUCCESS [14:40.583s]
[INFO] hadoop-yarn-server-tests .......................... FAILURE [53.673s]
[INFO] hadoop-yarn-client ................................ SKIPPED
[INFO] hadoop-yarn-applications .......................... SKIPPED
[INFO] hadoop-yarn-applications-distributedshell ......... SKIPPED
[INFO] hadoop-yarn-applications-unmanaged-am-launcher .... SKIPPED
[INFO] hadoop-yarn-site .................................. SKIPPED
[INFO] hadoop-yarn-project ............................... SKIPPED
[INFO] ------------------------------------------------------------------------
[INFO] BUILD FAILURE
[INFO] ------------------------------------------------------------------------
[INFO] Total time: 25:51.145s
[INFO] Finished at: Tue Dec 17 11:00:17 UTC 2013
[INFO] Final Memory: 51M/708M
[INFO] ------------------------------------------------------------------------
[ERROR] Failed to execute goal org.apache.maven.plugins:maven-surefire-plugin:2.16:test (default-test)
on project hadoop-yarn-server-tests: There are test failures.
[ERROR] 
[ERROR] Please refer to /home/jenkins/jenkins-slave/workspace/Hadoop-Yarn-trunk/trunk/hadoop-yarn-project/hadoop-yarn/hadoop-yarn-server/hadoop-yarn-server-tests/target/surefire-reports
for the individual test results.
[ERROR] -> [Help 1]
[ERROR] 
[ERROR] To see the full stack trace of the errors, re-run Maven with the -e switch.
[ERROR] Re-run Maven using the -X switch to enable full debug logging.
[ERROR] 
[ERROR] For more information about the errors and possible solutions, please read the following
articles:
[ERROR] [Help 1] http://cwiki.apache.org/confluence/display/MAVEN/MojoFailureException
[ERROR] 
[ERROR] After correcting the problems, you can resume the build with the command
[ERROR]   mvn <goals> -rf :hadoop-yarn-server-tests
Build step 'Execute shell' marked build as failure
Archiving artifacts
Updating HADOOP-8753
Updating HDFS-5454
Updating YARN-1446
Updating HADOOP-10106
Updating YARN-312
Updating HDFS-5350
Updating YARN-1451
Updating HDFS-5665
Updating HDFS-5666
Updating MAPREDUCE-5623
Updating YARN-1145
Updating YARN-1505
Sending e-mails to: yarn-dev@hadoop.apache.org
Email was triggered for: Failure
Sending email for trigger: Failure



###################################################################################
############################## FAILED TESTS (if any) ##############################
No tests ran.
Mime
  • Unnamed multipart/mixed (inline, None, 0 bytes)
View raw message