hadoop-yarn-dev mailing list archives

Site index · List index
Message view « Date » · « Thread »
Top « Date » · « Thread »
From Apache Jenkins Server <jenk...@builds.apache.org>
Subject Hadoop-Yarn-trunk - Build # 417 - Still Failing
Date Tue, 10 Dec 2013 11:01:08 GMT
See https://builds.apache.org/job/Hadoop-Yarn-trunk/417/

###################################################################################
########################## LAST 60 LINES OF THE CONSOLE ###########################
[...truncated 14887 lines...]

Running org.apache.hadoop.yarn.server.TestDiskFailures
Tests run: 3, Failures: 0, Errors: 0, Skipped: 0, Time elapsed: 18.272 sec - in org.apache.hadoop.yarn.server.TestDiskFailures

Results :

Tests in error: 
  TestRMNMSecretKeys.testNMUpdation:49->validateRMNMKeyExchange:69 » NullPointer
  TestContainerManagerSecurity.testContainerManager:110 » YarnRuntime java.io.IO...

Tests run: 7, Failures: 0, Errors: 2, Skipped: 0

[INFO] ------------------------------------------------------------------------
[INFO] Reactor Summary:
[INFO] 
[INFO] hadoop-yarn ....................................... SUCCESS [5.217s]
[INFO] hadoop-yarn-api ................................... SUCCESS [2:26.753s]
[INFO] hadoop-yarn-common ................................ SUCCESS [2:15.388s]
[INFO] hadoop-yarn-server ................................ SUCCESS [0.246s]
[INFO] hadoop-yarn-server-common ......................... SUCCESS [32.717s]
[INFO] hadoop-yarn-server-nodemanager .................... SUCCESS [4:33.332s]
[INFO] hadoop-yarn-server-web-proxy ...................... SUCCESS [16.842s]
[INFO] hadoop-yarn-server-resourcemanager ................ SUCCESS [14:31.658s]
[INFO] hadoop-yarn-server-tests .......................... FAILURE [54.504s]
[INFO] hadoop-yarn-client ................................ SKIPPED
[INFO] hadoop-yarn-applications .......................... SKIPPED
[INFO] hadoop-yarn-applications-distributedshell ......... SKIPPED
[INFO] hadoop-yarn-applications-unmanaged-am-launcher .... SKIPPED
[INFO] hadoop-yarn-site .................................. SKIPPED
[INFO] hadoop-yarn-project ............................... SKIPPED
[INFO] ------------------------------------------------------------------------
[INFO] BUILD FAILURE
[INFO] ------------------------------------------------------------------------
[INFO] Total time: 25:39.068s
[INFO] Finished at: Tue Dec 10 11:01:04 UTC 2013
[INFO] Final Memory: 55M/760M
[INFO] ------------------------------------------------------------------------
[ERROR] Failed to execute goal org.apache.maven.plugins:maven-surefire-plugin:2.16:test (default-test)
on project hadoop-yarn-server-tests: There are test failures.
[ERROR] 
[ERROR] Please refer to /home/jenkins/jenkins-slave/workspace/Hadoop-Yarn-trunk/trunk/hadoop-yarn-project/hadoop-yarn/hadoop-yarn-server/hadoop-yarn-server-tests/target/surefire-reports
for the individual test results.
[ERROR] -> [Help 1]
[ERROR] 
[ERROR] To see the full stack trace of the errors, re-run Maven with the -e switch.
[ERROR] Re-run Maven using the -X switch to enable full debug logging.
[ERROR] 
[ERROR] For more information about the errors and possible solutions, please read the following
articles:
[ERROR] [Help 1] http://cwiki.apache.org/confluence/display/MAVEN/MojoFailureException
[ERROR] 
[ERROR] After correcting the problems, you can resume the build with the command
[ERROR]   mvn <goals> -rf :hadoop-yarn-server-tests
Build step 'Execute shell' marked build as failure
Archiving artifacts
Updating HDFS-4983
Updating MAPREDUCE-5656
Updating HDFS-5629
Updating YARN-1448
Sending e-mails to: yarn-dev@hadoop.apache.org
Email was triggered for: Failure
Sending email for trigger: Failure



###################################################################################
############################## FAILED TESTS (if any) ##############################
No tests ran.
Mime
  • Unnamed multipart/mixed (inline, None, 0 bytes)
View raw message