hadoop-yarn-dev mailing list archives

Site index · List index
Message view « Date » · « Thread »
Top « Date » · « Thread »
From Apache Jenkins Server <jenk...@builds.apache.org>
Subject Failed: YARN-1446 PreCommit Build #2611
Date Fri, 06 Dec 2013 20:08:42 GMT
Jira: https://issues.apache.org/jira/browse/YARN-1446
Build: https://builds.apache.org/job/PreCommit-YARN-Build/2611/

###################################################################################
########################## LAST 60 LINES OF THE CONSOLE ###########################
[...truncated 3360 lines...]
NOP




{color:red}-1 overall{color}.  Here are the results of testing the latest attachment 
  http://issues.apache.org/jira/secure/attachment/12617454/YARN-1446.4.patch
  against trunk revision .

    {color:green}+1 @author{color}.  The patch does not contain any @author tags.

    {color:green}+1 tests included{color}.  The patch appears to include 6 new or modified
test files.

    {color:green}+1 javac{color}.  The applied patch does not increase the total number of
javac compiler warnings.

    {color:green}+1 javadoc{color}.  The javadoc tool did not generate any warning messages.

    {color:green}+1 eclipse:eclipse{color}.  The patch built with eclipse:eclipse.

    {color:green}+1 findbugs{color}.  The patch does not introduce any new Findbugs (version
1.3.9) warnings.

    {color:green}+1 release audit{color}.  The applied patch does not increase the total number
of release audit warnings.

    {color:red}-1 core tests{color}.  The patch failed these unit tests in hadoop-yarn-project/hadoop-yarn/hadoop-yarn-api
hadoop-yarn-project/hadoop-yarn/hadoop-yarn-client hadoop-yarn-project/hadoop-yarn/hadoop-yarn-common
hadoop-yarn-project/hadoop-yarn/hadoop-yarn-server/hadoop-yarn-server-resourcemanager:

                  org.apache.hadoop.yarn.server.resourcemanager.TestRMRestart

    {color:green}+1 contrib tests{color}.  The patch passed contrib unit tests.

Test results: https://builds.apache.org/job/PreCommit-YARN-Build/2611//testReport/
Console output: https://builds.apache.org/job/PreCommit-YARN-Build/2611//console

This message is automatically generated.


======================================================================
======================================================================
    Adding comment to Jira.
======================================================================
======================================================================


Comment added.
d9cb312b6cf4a8f5db8bfaed609c5e2407a25ce6 logged out


======================================================================
======================================================================
    Finished build.
======================================================================
======================================================================


Build step 'Execute shell' marked build as failure
Archiving artifacts
[description-setter] Could not determine description.
Recording test results
Email was triggered for: Failure
Sending email for trigger: Failure



###################################################################################
############################## FAILED TESTS (if any) ##############################
1 tests failed.
FAILED:  org.apache.hadoop.yarn.server.resourcemanager.TestRMRestart.testRMRestartAppRunningAMFailed

Error Message:
expected:<FAILED> but was:<NEW>

Stack Trace:
java.lang.AssertionError: expected:<FAILED> but was:<NEW>
	at org.junit.Assert.fail(Assert.java:93)
	at org.junit.Assert.failNotEquals(Assert.java:647)
	at org.junit.Assert.assertEquals(Assert.java:128)
	at org.junit.Assert.assertEquals(Assert.java:147)
	at org.apache.hadoop.yarn.server.resourcemanager.TestRMRestart.testRMRestartAppRunningAMFailed(TestRMRestart.java:422)



Mime
  • Unnamed multipart/mixed (inline, None, 0 bytes)
View raw message