hadoop-yarn-dev mailing list archives

Site index · List index
Message view « Date » · « Thread »
Top « Date » · « Thread »
From Apache Jenkins Server <jenk...@builds.apache.org>
Subject Build failed in Jenkins: Hadoop-Yarn-trunk #437
Date Mon, 30 Dec 2013 11:06:13 GMT
See <https://builds.apache.org/job/Hadoop-Yarn-trunk/437/changes>

Changes:

[shv] HDFS-5675. Add Mkdirs operation to NNThroughputBenchmark. Contributed by Plamen Jeliazkov.

------------------------------------------
[...truncated 14841 lines...]
Generating <https://builds.apache.org/job/Hadoop-Yarn-trunk/ws/trunk/hadoop-yarn-project/hadoop-yarn/hadoop-yarn-server/hadoop-yarn-server-resourcemanager/target/org/apache/hadoop/yarn/server/resourcemanager/monitor//package-use.html...>
Generating <https://builds.apache.org/job/Hadoop-Yarn-trunk/ws/trunk/hadoop-yarn-project/hadoop-yarn/hadoop-yarn-server/hadoop-yarn-server-resourcemanager/target/org/apache/hadoop/yarn/server/resourcemanager/monitor/capacity//package-use.html...>
Generating <https://builds.apache.org/job/Hadoop-Yarn-trunk/ws/trunk/hadoop-yarn-project/hadoop-yarn/hadoop-yarn-server/hadoop-yarn-server-resourcemanager/target/org/apache/hadoop/yarn/server/resourcemanager/recovery//package-use.html...>
Generating <https://builds.apache.org/job/Hadoop-Yarn-trunk/ws/trunk/hadoop-yarn-project/hadoop-yarn/hadoop-yarn-server/hadoop-yarn-server-resourcemanager/target/org/apache/hadoop/yarn/server/resourcemanager/recovery/records//package-use.html...>
Generating <https://builds.apache.org/job/Hadoop-Yarn-trunk/ws/trunk/hadoop-yarn-project/hadoop-yarn/hadoop-yarn-server/hadoop-yarn-server-resourcemanager/target/org/apache/hadoop/yarn/server/resourcemanager/recovery/records/impl/pb//package-use.html...>
Generating <https://builds.apache.org/job/Hadoop-Yarn-trunk/ws/trunk/hadoop-yarn-project/hadoop-yarn/hadoop-yarn-server/hadoop-yarn-server-resourcemanager/target/org/apache/hadoop/yarn/server/resourcemanager/resource//package-use.html...>
Generating <https://builds.apache.org/job/Hadoop-Yarn-trunk/ws/trunk/hadoop-yarn-project/hadoop-yarn/hadoop-yarn-server/hadoop-yarn-server-resourcemanager/target/org/apache/hadoop/yarn/server/resourcemanager/rmapp//package-use.html...>
Generating <https://builds.apache.org/job/Hadoop-Yarn-trunk/ws/trunk/hadoop-yarn-project/hadoop-yarn/hadoop-yarn-server/hadoop-yarn-server-resourcemanager/target/org/apache/hadoop/yarn/server/resourcemanager/rmapp/attempt//package-use.html...>
Generating <https://builds.apache.org/job/Hadoop-Yarn-trunk/ws/trunk/hadoop-yarn-project/hadoop-yarn/hadoop-yarn-server/hadoop-yarn-server-resourcemanager/target/org/apache/hadoop/yarn/server/resourcemanager/rmapp/attempt/event//package-use.html...>
Generating <https://builds.apache.org/job/Hadoop-Yarn-trunk/ws/trunk/hadoop-yarn-project/hadoop-yarn/hadoop-yarn-server/hadoop-yarn-server-resourcemanager/target/org/apache/hadoop/yarn/server/resourcemanager/rmcontainer//package-use.html...>
Generating <https://builds.apache.org/job/Hadoop-Yarn-trunk/ws/trunk/hadoop-yarn-project/hadoop-yarn/hadoop-yarn-server/hadoop-yarn-server-resourcemanager/target/org/apache/hadoop/yarn/server/resourcemanager/rmnode//package-use.html...>
Generating <https://builds.apache.org/job/Hadoop-Yarn-trunk/ws/trunk/hadoop-yarn-project/hadoop-yarn/hadoop-yarn-server/hadoop-yarn-server-resourcemanager/target/org/apache/hadoop/yarn/server/resourcemanager/scheduler//package-use.html...>
Generating <https://builds.apache.org/job/Hadoop-Yarn-trunk/ws/trunk/hadoop-yarn-project/hadoop-yarn/hadoop-yarn-server/hadoop-yarn-server-resourcemanager/target/org/apache/hadoop/yarn/server/resourcemanager/scheduler/capacity//package-use.html...>
Generating <https://builds.apache.org/job/Hadoop-Yarn-trunk/ws/trunk/hadoop-yarn-project/hadoop-yarn/hadoop-yarn-server/hadoop-yarn-server-resourcemanager/target/org/apache/hadoop/yarn/server/resourcemanager/scheduler/common/fica//package-use.html...>
Generating <https://builds.apache.org/job/Hadoop-Yarn-trunk/ws/trunk/hadoop-yarn-project/hadoop-yarn/hadoop-yarn-server/hadoop-yarn-server-resourcemanager/target/org/apache/hadoop/yarn/server/resourcemanager/scheduler/event//package-use.html...>
Generating <https://builds.apache.org/job/Hadoop-Yarn-trunk/ws/trunk/hadoop-yarn-project/hadoop-yarn/hadoop-yarn-server/hadoop-yarn-server-resourcemanager/target/org/apache/hadoop/yarn/server/resourcemanager/scheduler/fair//package-use.html...>
Generating <https://builds.apache.org/job/Hadoop-Yarn-trunk/ws/trunk/hadoop-yarn-project/hadoop-yarn/hadoop-yarn-server/hadoop-yarn-server-resourcemanager/target/org/apache/hadoop/yarn/server/resourcemanager/scheduler/fair/policies//package-use.html...>
Generating <https://builds.apache.org/job/Hadoop-Yarn-trunk/ws/trunk/hadoop-yarn-project/hadoop-yarn/hadoop-yarn-server/hadoop-yarn-server-resourcemanager/target/org/apache/hadoop/yarn/server/resourcemanager/scheduler/fifo//package-use.html...>
Generating <https://builds.apache.org/job/Hadoop-Yarn-trunk/ws/trunk/hadoop-yarn-project/hadoop-yarn/hadoop-yarn-server/hadoop-yarn-server-resourcemanager/target/org/apache/hadoop/yarn/server/resourcemanager/security//package-use.html...>
Generating <https://builds.apache.org/job/Hadoop-Yarn-trunk/ws/trunk/hadoop-yarn-project/hadoop-yarn/hadoop-yarn-server/hadoop-yarn-server-resourcemanager/target/org/apache/hadoop/yarn/server/resourcemanager/security/authorize//package-use.html...>
Generating <https://builds.apache.org/job/Hadoop-Yarn-trunk/ws/trunk/hadoop-yarn-project/hadoop-yarn/hadoop-yarn-server/hadoop-yarn-server-resourcemanager/target/org/apache/hadoop/yarn/server/resourcemanager/webapp//package-use.html...>
Generating <https://builds.apache.org/job/Hadoop-Yarn-trunk/ws/trunk/hadoop-yarn-project/hadoop-yarn/hadoop-yarn-server/hadoop-yarn-server-resourcemanager/target/org/apache/hadoop/yarn/server/resourcemanager/webapp/dao//package-use.html...>
Building index for all the packages and classes...
Generating <https://builds.apache.org/job/Hadoop-Yarn-trunk/ws/trunk/hadoop-yarn-project/hadoop-yarn/hadoop-yarn-server/hadoop-yarn-server-resourcemanager/target/overview-tree.html...>
Generating <https://builds.apache.org/job/Hadoop-Yarn-trunk/ws/trunk/hadoop-yarn-project/hadoop-yarn/hadoop-yarn-server/hadoop-yarn-server-resourcemanager/target/index-all.html...>
Generating <https://builds.apache.org/job/Hadoop-Yarn-trunk/ws/trunk/hadoop-yarn-project/hadoop-yarn/hadoop-yarn-server/hadoop-yarn-server-resourcemanager/target/deprecated-list.html...>
Building index for all classes...
Generating <https://builds.apache.org/job/Hadoop-Yarn-trunk/ws/trunk/hadoop-yarn-project/hadoop-yarn/hadoop-yarn-server/hadoop-yarn-server-resourcemanager/target/allclasses-frame.html...>
Generating <https://builds.apache.org/job/Hadoop-Yarn-trunk/ws/trunk/hadoop-yarn-project/hadoop-yarn/hadoop-yarn-server/hadoop-yarn-server-resourcemanager/target/allclasses-noframe.html...>
Generating <https://builds.apache.org/job/Hadoop-Yarn-trunk/ws/trunk/hadoop-yarn-project/hadoop-yarn/hadoop-yarn-server/hadoop-yarn-server-resourcemanager/target/index.html...>
Generating <https://builds.apache.org/job/Hadoop-Yarn-trunk/ws/trunk/hadoop-yarn-project/hadoop-yarn/hadoop-yarn-server/hadoop-yarn-server-resourcemanager/target/overview-summary.html...>
Generating <https://builds.apache.org/job/Hadoop-Yarn-trunk/ws/trunk/hadoop-yarn-project/hadoop-yarn/hadoop-yarn-server/hadoop-yarn-server-resourcemanager/target/help-doc.html...>
Generating <https://builds.apache.org/job/Hadoop-Yarn-trunk/ws/trunk/hadoop-yarn-project/hadoop-yarn/hadoop-yarn-server/hadoop-yarn-server-resourcemanager/target/stylesheet.css...>
[INFO] Building jar: <https://builds.apache.org/job/Hadoop-Yarn-trunk/ws/trunk/hadoop-yarn-project/hadoop-yarn/hadoop-yarn-server/hadoop-yarn-server-resourcemanager/target/hadoop-yarn-server-resourcemanager-3.0.0-SNAPSHOT-javadoc.jar>
[INFO] 
[INFO] --- maven-enforcer-plugin:1.3.1:enforce (depcheck) @ hadoop-yarn-server-resourcemanager
---
[INFO] 
[INFO] --- maven-checkstyle-plugin:2.6:checkstyle (default-cli) @ hadoop-yarn-server-resourcemanager
---
[INFO] 
[INFO] There are 11454 checkstyle errors.
[WARNING] Unable to locate Source XRef to link to - DISABLED
[INFO] 
[INFO] --- findbugs-maven-plugin:2.3.2:findbugs (default-cli) @ hadoop-yarn-server-resourcemanager
---
[INFO] ****** FindBugsMojo execute *******
[INFO] canGenerate is true
[INFO] ****** FindBugsMojo executeFindbugs *******
[INFO] Temp File is <https://builds.apache.org/job/Hadoop-Yarn-trunk/ws/trunk/hadoop-yarn-project/hadoop-yarn/hadoop-yarn-server/hadoop-yarn-server-resourcemanager/target/findbugsTemp.xml>
[INFO] Fork Value is true
[INFO] xmlOutput is true
[INFO]                                                                         
[INFO] ------------------------------------------------------------------------
[INFO] Building hadoop-yarn-server-tests 3.0.0-SNAPSHOT
[INFO] ------------------------------------------------------------------------
[WARNING] The POM for org.eclipse.m2e:lifecycle-mapping:jar:1.0.0 is missing, no dependency
information available
[WARNING] Failed to retrieve plugin descriptor for org.eclipse.m2e:lifecycle-mapping:1.0.0:
Plugin org.eclipse.m2e:lifecycle-mapping:1.0.0 or one of its dependencies could not be resolved:
Failed to read artifact descriptor for org.eclipse.m2e:lifecycle-mapping:jar:1.0.0
[INFO] 
[INFO] --- maven-clean-plugin:2.4.1:clean (default-clean) @ hadoop-yarn-server-tests ---
[INFO] Deleting <https://builds.apache.org/job/Hadoop-Yarn-trunk/ws/trunk/hadoop-yarn-project/hadoop-yarn/hadoop-yarn-server/hadoop-yarn-server-tests/target>
[INFO] 
[INFO] --- maven-antrun-plugin:1.7:run (create-testdirs) @ hadoop-yarn-server-tests ---
[INFO] Executing tasks

main:
    [mkdir] Created dir: <https://builds.apache.org/job/Hadoop-Yarn-trunk/ws/trunk/hadoop-yarn-project/hadoop-yarn/hadoop-yarn-server/hadoop-yarn-server-tests/target/test-dir>
[INFO] Executed tasks
[INFO] 
[INFO] --- maven-resources-plugin:2.2:resources (default-resources) @ hadoop-yarn-server-tests
---
[INFO] Using default encoding to copy filtered resources.
[INFO] 
[INFO] --- maven-compiler-plugin:2.5.1:compile (default-compile) @ hadoop-yarn-server-tests
---
[INFO] No sources to compile
[INFO] 
[INFO] --- maven-resources-plugin:2.2:testResources (default-testResources) @ hadoop-yarn-server-tests
---
[INFO] Using default encoding to copy filtered resources.
[INFO] 
[INFO] --- maven-compiler-plugin:2.5.1:testCompile (default-testCompile) @ hadoop-yarn-server-tests
---
[INFO] Compiling 5 source files to <https://builds.apache.org/job/Hadoop-Yarn-trunk/ws/trunk/hadoop-yarn-project/hadoop-yarn/hadoop-yarn-server/hadoop-yarn-server-tests/target/test-classes>
[INFO] 
[INFO] --- maven-jar-plugin:2.3.1:test-jar (default) @ hadoop-yarn-server-tests ---
[INFO] Building jar: <https://builds.apache.org/job/Hadoop-Yarn-trunk/ws/trunk/hadoop-yarn-project/hadoop-yarn/hadoop-yarn-server/hadoop-yarn-server-tests/target/hadoop-yarn-server-tests-3.0.0-SNAPSHOT-tests.jar>
[INFO] 
[INFO] --- maven-surefire-plugin:2.16:test (default-test) @ hadoop-yarn-server-tests ---
[INFO] Surefire report directory: <https://builds.apache.org/job/Hadoop-Yarn-trunk/ws/trunk/hadoop-yarn-project/hadoop-yarn/hadoop-yarn-server/hadoop-yarn-server-tests/target/surefire-reports>

-------------------------------------------------------
 T E S T S
-------------------------------------------------------

-------------------------------------------------------
 T E S T S
-------------------------------------------------------
Running org.apache.hadoop.yarn.server.TestRMNMSecretKeys
Tests run: 1, Failures: 0, Errors: 0, Skipped: 0, Time elapsed: 1.568 sec - in org.apache.hadoop.yarn.server.TestRMNMSecretKeys
Running org.apache.hadoop.yarn.server.TestMiniYARNClusterForHA
Tests run: 1, Failures: 0, Errors: 0, Skipped: 0, Time elapsed: 6.873 sec - in org.apache.hadoop.yarn.server.TestMiniYARNClusterForHA
Running org.apache.hadoop.yarn.server.TestContainerManagerSecurity
Tests run: 2, Failures: 0, Errors: 0, Skipped: 0, Time elapsed: 52.234 sec - in org.apache.hadoop.yarn.server.TestContainerManagerSecurity
Running org.apache.hadoop.yarn.server.TestDiskFailures
Tests run: 3, Failures: 0, Errors: 0, Skipped: 0, Time elapsed: 17.295 sec - in org.apache.hadoop.yarn.server.TestDiskFailures

Results :

Tests run: 7, Failures: 0, Errors: 0, Skipped: 0

[INFO] 
[INFO] --- maven-jar-plugin:2.3.1:jar (default-jar) @ hadoop-yarn-server-tests ---
[WARNING] JAR will be empty - no content was marked for inclusion!
[INFO] Building jar: <https://builds.apache.org/job/Hadoop-Yarn-trunk/ws/trunk/hadoop-yarn-project/hadoop-yarn/hadoop-yarn-server/hadoop-yarn-server-tests/target/hadoop-yarn-server-tests-3.0.0-SNAPSHOT.jar>
[INFO] 
[INFO] --- maven-source-plugin:2.1.2:jar-no-fork (hadoop-java-sources) @ hadoop-yarn-server-tests
---
[INFO] No sources in project. Archive not created.
[INFO] 
[INFO] --- maven-source-plugin:2.1.2:test-jar-no-fork (hadoop-java-sources) @ hadoop-yarn-server-tests
---
[INFO] Building jar: <https://builds.apache.org/job/Hadoop-Yarn-trunk/ws/trunk/hadoop-yarn-project/hadoop-yarn/hadoop-yarn-server/hadoop-yarn-server-tests/target/hadoop-yarn-server-tests-3.0.0-SNAPSHOT-test-sources.jar>
[INFO] 
[INFO] --- maven-enforcer-plugin:1.3.1:enforce (dist-enforce) @ hadoop-yarn-server-tests ---
[INFO] 
[INFO] --- maven-site-plugin:3.0:attach-descriptor (attach-descriptor) @ hadoop-yarn-server-tests
---
[INFO] 
[INFO] --- maven-javadoc-plugin:2.8.1:jar (module-javadocs) @ hadoop-yarn-server-tests ---
[INFO] Building jar: <https://builds.apache.org/job/Hadoop-Yarn-trunk/ws/trunk/hadoop-yarn-project/hadoop-yarn/hadoop-yarn-server/hadoop-yarn-server-tests/target/hadoop-yarn-server-tests-3.0.0-SNAPSHOT-javadoc.jar>
[INFO] 
[INFO] --- maven-enforcer-plugin:1.3.1:enforce (depcheck) @ hadoop-yarn-server-tests ---
[INFO] 
[INFO] --- maven-checkstyle-plugin:2.6:checkstyle (default-cli) @ hadoop-yarn-server-tests
---
[INFO] 
[INFO] --- findbugs-maven-plugin:2.3.2:findbugs (default-cli) @ hadoop-yarn-server-tests ---
[INFO] ****** FindBugsMojo execute *******
[INFO] canGenerate is false
[INFO]                                                                         
[INFO] ------------------------------------------------------------------------
[INFO] Building hadoop-yarn-client 3.0.0-SNAPSHOT
[INFO] ------------------------------------------------------------------------
[WARNING] The POM for org.eclipse.m2e:lifecycle-mapping:jar:1.0.0 is missing, no dependency
information available
[WARNING] Failed to retrieve plugin descriptor for org.eclipse.m2e:lifecycle-mapping:1.0.0:
Plugin org.eclipse.m2e:lifecycle-mapping:1.0.0 or one of its dependencies could not be resolved:
Failed to read artifact descriptor for org.eclipse.m2e:lifecycle-mapping:jar:1.0.0
[INFO] 
[INFO] --- maven-clean-plugin:2.4.1:clean (default-clean) @ hadoop-yarn-client ---
[INFO] Deleting <https://builds.apache.org/job/Hadoop-Yarn-trunk/ws/trunk/hadoop-yarn-project/hadoop-yarn/hadoop-yarn-client/target>
[INFO] 
[INFO] --- maven-antrun-plugin:1.7:run (create-testdirs) @ hadoop-yarn-client ---
[INFO] Executing tasks

main:
    [mkdir] Created dir: <https://builds.apache.org/job/Hadoop-Yarn-trunk/ws/trunk/hadoop-yarn-project/hadoop-yarn/hadoop-yarn-client/target/test-dir>
[INFO] Executed tasks
[INFO] 
[INFO] --- maven-resources-plugin:2.2:resources (default-resources) @ hadoop-yarn-client ---
[INFO] Using default encoding to copy filtered resources.
[INFO] 
[INFO] --- maven-compiler-plugin:2.5.1:compile (default-compile) @ hadoop-yarn-client ---
[INFO] Compiling 25 source files to <https://builds.apache.org/job/Hadoop-Yarn-trunk/ws/trunk/hadoop-yarn-project/hadoop-yarn/hadoop-yarn-client/target/classes>
[INFO] 
[INFO] --- maven-resources-plugin:2.2:testResources (default-testResources) @ hadoop-yarn-client
---
[INFO] Using default encoding to copy filtered resources.
[INFO] 
[INFO] --- maven-compiler-plugin:2.5.1:testCompile (default-testCompile) @ hadoop-yarn-client
---
[INFO] Compiling 14 source files to <https://builds.apache.org/job/Hadoop-Yarn-trunk/ws/trunk/hadoop-yarn-project/hadoop-yarn/hadoop-yarn-client/target/test-classes>
[INFO] 
[INFO] --- maven-surefire-plugin:2.16:test (default-test) @ hadoop-yarn-client ---
[INFO] Surefire report directory: <https://builds.apache.org/job/Hadoop-Yarn-trunk/ws/trunk/hadoop-yarn-project/hadoop-yarn/hadoop-yarn-client/target/surefire-reports>

-------------------------------------------------------
 T E S T S
-------------------------------------------------------

-------------------------------------------------------
 T E S T S
-------------------------------------------------------
Running org.apache.hadoop.yarn.client.cli.TestLogsCLI
Tests run: 4, Failures: 0, Errors: 0, Skipped: 0, Time elapsed: 0.972 sec - in org.apache.hadoop.yarn.client.cli.TestLogsCLI
Running org.apache.hadoop.yarn.client.cli.TestYarnCLI
Tests run: 12, Failures: 0, Errors: 0, Skipped: 0, Time elapsed: 1.503 sec - in org.apache.hadoop.yarn.client.cli.TestYarnCLI
Running org.apache.hadoop.yarn.client.TestResourceManagerAdministrationProtocolPBClientImpl
Tests run: 7, Failures: 0, Errors: 0, Skipped: 0, Time elapsed: 2.717 sec - in org.apache.hadoop.yarn.client.TestResourceManagerAdministrationProtocolPBClientImpl
Running org.apache.hadoop.yarn.client.api.async.impl.TestNMClientAsync
Tests run: 2, Failures: 0, Errors: 0, Skipped: 0, Time elapsed: 0.857 sec - in org.apache.hadoop.yarn.client.api.async.impl.TestNMClientAsync
Running org.apache.hadoop.yarn.client.api.async.impl.TestAMRMClientAsync
Tests run: 8, Failures: 0, Errors: 0, Skipped: 0, Time elapsed: 0.825 sec - in org.apache.hadoop.yarn.client.api.async.impl.TestAMRMClientAsync
Running org.apache.hadoop.yarn.client.api.impl.TestYarnClient
Tests run: 8, Failures: 0, Errors: 0, Skipped: 0, Time elapsed: 30.436 sec - in org.apache.hadoop.yarn.client.api.impl.TestYarnClient
Running org.apache.hadoop.yarn.client.api.impl.TestAMRMClientContainerRequest
Tests run: 5, Failures: 0, Errors: 0, Skipped: 0, Time elapsed: 0.523 sec - in org.apache.hadoop.yarn.client.api.impl.TestAMRMClientContainerRequest
Running org.apache.hadoop.yarn.client.api.impl.TestAMRMClient
Tests run: 6, Failures: 0, Errors: 0, Skipped: 0, Time elapsed: 116.549 sec - in org.apache.hadoop.yarn.client.api.impl.TestAMRMClient
Running org.apache.hadoop.yarn.client.api.impl.TestNMClient
Tests run: 2, Failures: 0, Errors: 0, Skipped: 0, Time elapsed: 81.669 sec - in org.apache.hadoop.yarn.client.api.impl.TestNMClient
Running org.apache.hadoop.yarn.client.TestRMFailover
Tests run: 1, Failures: 1, Errors: 0, Skipped: 0, Time elapsed: 13.599 sec <<< FAILURE!
- in org.apache.hadoop.yarn.client.TestRMFailover
testExplicitFailover(org.apache.hadoop.yarn.client.TestRMFailover)  Time elapsed: 5.065 sec
 <<< FAILURE!
java.lang.AssertionError: NMs failed to connect to the RM
	at org.junit.Assert.fail(Assert.java:93)
	at org.junit.Assert.assertTrue(Assert.java:43)
	at org.apache.hadoop.yarn.client.TestRMFailover.testExplicitFailover(TestRMFailover.java:129)

Running org.apache.hadoop.yarn.client.TestYarnApiClasses
Tests run: 3, Failures: 0, Errors: 0, Skipped: 0, Time elapsed: 0.313 sec - in org.apache.hadoop.yarn.client.TestYarnApiClasses
Running org.apache.hadoop.yarn.client.TestGetGroups
Tests run: 6, Failures: 0, Errors: 0, Skipped: 0, Time elapsed: 2.635 sec - in org.apache.hadoop.yarn.client.TestGetGroups
Running org.apache.hadoop.yarn.client.TestRMAdminCLI
Tests run: 13, Failures: 0, Errors: 0, Skipped: 0, Time elapsed: 0.616 sec - in org.apache.hadoop.yarn.client.TestRMAdminCLI

Results :

Failed tests: 
  TestRMFailover.testExplicitFailover:129 NMs failed to connect to the RM

Tests run: 77, Failures: 1, Errors: 0, Skipped: 0

[INFO] ------------------------------------------------------------------------
[INFO] Reactor Summary:
[INFO] 
[INFO] hadoop-yarn ....................................... SUCCESS [5.553s]
[INFO] hadoop-yarn-api ................................... SUCCESS [2:29.497s]
[INFO] hadoop-yarn-common ................................ SUCCESS [2:16.779s]
[INFO] hadoop-yarn-server ................................ SUCCESS [0.226s]
[INFO] hadoop-yarn-server-common ......................... SUCCESS [31.794s]
[INFO] hadoop-yarn-server-nodemanager .................... SUCCESS [4:32.609s]
[INFO] hadoop-yarn-server-web-proxy ...................... SUCCESS [19.507s]
[INFO] hadoop-yarn-server-resourcemanager ................ SUCCESS [15:12.268s]
[INFO] hadoop-yarn-server-tests .......................... SUCCESS [1:21.468s]
[INFO] hadoop-yarn-client ................................ FAILURE [4:16.811s]
[INFO] hadoop-yarn-applications .......................... SKIPPED
[INFO] hadoop-yarn-applications-distributedshell ......... SKIPPED
[INFO] hadoop-yarn-applications-unmanaged-am-launcher .... SKIPPED
[INFO] hadoop-yarn-site .................................. SKIPPED
[INFO] hadoop-yarn-project ............................... SKIPPED
[INFO] ------------------------------------------------------------------------
[INFO] BUILD FAILURE
[INFO] ------------------------------------------------------------------------
[INFO] Total time: 31:08.627s
[INFO] Finished at: Mon Dec 30 11:06:06 UTC 2013
[INFO] Final Memory: 57M/783M
[INFO] ------------------------------------------------------------------------
[ERROR] Failed to execute goal org.apache.maven.plugins:maven-surefire-plugin:2.16:test (default-test)
on project hadoop-yarn-client: There are test failures.
[ERROR] 
[ERROR] Please refer to <https://builds.apache.org/job/Hadoop-Yarn-trunk/ws/trunk/hadoop-yarn-project/hadoop-yarn/hadoop-yarn-client/target/surefire-reports>
for the individual test results.
[ERROR] -> [Help 1]
[ERROR] 
[ERROR] To see the full stack trace of the errors, re-run Maven with the -e switch.
[ERROR] Re-run Maven using the -X switch to enable full debug logging.
[ERROR] 
[ERROR] For more information about the errors and possible solutions, please read the following
articles:
[ERROR] [Help 1] http://cwiki.apache.org/confluence/display/MAVEN/MojoFailureException
[ERROR] 
[ERROR] After correcting the problems, you can resume the build with the command
[ERROR]   mvn <goals> -rf :hadoop-yarn-client
Build step 'Execute shell' marked build as failure
Archiving artifacts
Updating HDFS-5675

Mime
View raw message