hadoop-yarn-dev mailing list archives

Site index · List index
Message view « Date » · « Thread »
Top « Date » · « Thread »
From Apache Jenkins Server <jenk...@builds.apache.org>
Subject Failed: YARN-1445 PreCommit Build #2676
Date Tue, 17 Dec 2013 12:16:33 GMT
Jira: https://issues.apache.org/jira/browse/YARN-1445
Build: https://builds.apache.org/job/PreCommit-YARN-Build/2676/

###################################################################################
########################## LAST 60 LINES OF THE CONSOLE ###########################
[...truncated 3841 lines...]
  http://issues.apache.org/jira/secure/attachment/12619070/YARN-1445.5.patch
  against trunk revision .

    {color:green}+1 @author{color}.  The patch does not contain any @author tags.

    {color:green}+1 tests included{color}.  The patch appears to include 2 new or modified
test files.

    {color:green}+1 javac{color}.  The applied patch does not increase the total number of
javac compiler warnings.

    {color:green}+1 javadoc{color}.  The javadoc tool did not generate any warning messages.

    {color:green}+1 eclipse:eclipse{color}.  The patch built with eclipse:eclipse.

    {color:green}+1 findbugs{color}.  The patch does not introduce any new Findbugs (version
1.3.9) warnings.

    {color:green}+1 release audit{color}.  The applied patch does not increase the total number
of release audit warnings.

    {color:red}-1 core tests{color}.  The patch failed these unit tests in hadoop-mapreduce-project/hadoop-mapreduce-client/hadoop-mapreduce-client-common
hadoop-mapreduce-project/hadoop-mapreduce-client/hadoop-mapreduce-client-jobclient hadoop-yarn-project/hadoop-yarn/hadoop-yarn-api
hadoop-yarn-project/hadoop-yarn/hadoop-yarn-client hadoop-yarn-project/hadoop-yarn/hadoop-yarn-server/hadoop-yarn-server-resourcemanager
hadoop-yarn-project/hadoop-yarn/hadoop-yarn-server/hadoop-yarn-server-web-proxy hadoop-yarn-project/hadoop-yarn/hadoop-yarn-site:

                  org.apache.hadoop.mapred.TestYARNRunner
                  org.apache.hadoop.mapreduce.security.TestJHSSecurity

                                      The following test timeouts occurred in hadoop-mapreduce-project/hadoop-mapreduce-client/hadoop-mapreduce-client-common
hadoop-mapreduce-project/hadoop-mapreduce-client/hadoop-mapreduce-client-jobclient hadoop-yarn-project/hadoop-yarn/hadoop-yarn-api
hadoop-yarn-project/hadoop-yarn/hadoop-yarn-client hadoop-yarn-project/hadoop-yarn/hadoop-yarn-server/hadoop-yarn-server-resourcemanager
hadoop-yarn-project/hadoop-yarn/hadoop-yarn-server/hadoop-yarn-server-web-proxy hadoop-yarn-project/hadoop-yarn/hadoop-yarn-site:

org.apache.hadoop.mapreduce.lib.jobcontrol.TestMapReduceJobControl
org.apache.hadoop.mapred.TestClientRedirect

    {color:green}+1 contrib tests{color}.  The patch passed contrib unit tests.

Test results: https://builds.apache.org/job/PreCommit-YARN-Build/2676//testReport/
Console output: https://builds.apache.org/job/PreCommit-YARN-Build/2676//console

This message is automatically generated.


======================================================================
======================================================================
    Adding comment to Jira.
======================================================================
======================================================================


Comment added.
a6c17505563c7fa3c764d55e4c38a2393008929e logged out


======================================================================
======================================================================
    Finished build.
======================================================================
======================================================================


Build step 'Execute shell' marked build as failure
Archiving artifacts
[description-setter] Could not determine description.
Recording test results
Email was triggered for: Failure
Sending email for trigger: Failure



###################################################################################
############################## FAILED TESTS (if any) ##############################
2 tests failed.
FAILED:  org.apache.hadoop.mapred.TestYARNRunner.testResourceMgrDelegate

Error Message:
null

Stack Trace:
java.lang.NullPointerException: null
	at org.apache.hadoop.yarn.client.api.impl.YarnClientImpl.killApplication(YarnClientImpl.java:201)
	at org.apache.hadoop.mapred.ResourceMgrDelegate.killApplication(ResourceMgrDelegate.java:284)
	at org.apache.hadoop.mapred.TestYARNRunner.testResourceMgrDelegate(TestYARNRunner.java:212)


FAILED:  org.apache.hadoop.mapreduce.security.TestJHSSecurity.testDelegationToken

Error Message:
null

Stack Trace:
java.lang.NullPointerException: null
	at java.util.Hashtable.get(Hashtable.java:334)
	at java.util.Properties.getProperty(Properties.java:932)
	at org.apache.hadoop.conf.Configuration.get(Configuration.java:874)
	at org.apache.hadoop.http.HttpServer.initSpnego(HttpServer.java:892)
	at org.apache.hadoop.http.HttpServer.access$100(HttpServer.java:101)
	at org.apache.hadoop.http.HttpServer$Builder.build(HttpServer.java:323)
	at org.apache.hadoop.yarn.webapp.WebApps$Builder.start(WebApps.java:232)
	at org.apache.hadoop.mapreduce.v2.hs.HistoryClientService.initializeWebApp(HistoryClientService.java:149)
	at org.apache.hadoop.mapreduce.v2.hs.HistoryClientService.serviceStart(HistoryClientService.java:118)
	at org.apache.hadoop.service.AbstractService.start(AbstractService.java:193)
	at org.apache.hadoop.service.CompositeService.serviceStart(CompositeService.java:121)
	at org.apache.hadoop.mapreduce.v2.hs.JobHistoryServer.serviceStart(JobHistoryServer.java:175)
	at org.apache.hadoop.service.AbstractService.start(AbstractService.java:193)
	at org.apache.hadoop.mapreduce.security.TestJHSSecurity.testDelegationToken(TestJHSSecurity.java:100)



Mime
  • Unnamed multipart/mixed (inline, None, 0 bytes)
View raw message