hadoop-yarn-dev mailing list archives

Site index · List index
Message view « Date » · « Thread »
Top « Date » · « Thread »
From Apache Jenkins Server <jenk...@builds.apache.org>
Subject Hadoop-Yarn-trunk - Build # 435 - Still Failing
Date Sat, 28 Dec 2013 11:08:24 GMT
See https://builds.apache.org/job/Hadoop-Yarn-trunk/435/

###################################################################################
########################## LAST 60 LINES OF THE CONSOLE ###########################
[...truncated 15368 lines...]
java.lang.RuntimeException: Failed to receive final expected state in ApplicationReport, CurrentState=RUNNING,
ExpectedStates=FINISHED,FAILED,KILLED
	at org.apache.hadoop.yarn.applications.unmanagedamlauncher.UnmanagedAMLauncher.monitorApplication(UnmanagedAMLauncher.java:447)
	at org.apache.hadoop.yarn.applications.unmanagedamlauncher.UnmanagedAMLauncher.run(UnmanagedAMLauncher.java:352)
	at org.apache.hadoop.yarn.applications.unmanagedamlauncher.TestUnmanagedAMLauncher.testDSShell(TestUnmanagedAMLauncher.java:147)


Results :

Tests in error: 
  TestUnmanagedAMLauncher.testDSShell:147 ยป Runtime Failed to receive final expe...

Tests run: 2, Failures: 0, Errors: 1, Skipped: 0

[INFO] ------------------------------------------------------------------------
[INFO] Reactor Summary:
[INFO] 
[INFO] hadoop-yarn ....................................... SUCCESS [4.681s]
[INFO] hadoop-yarn-api ................................... SUCCESS [2:30.750s]
[INFO] hadoop-yarn-common ................................ SUCCESS [2:14.904s]
[INFO] hadoop-yarn-server ................................ SUCCESS [0.243s]
[INFO] hadoop-yarn-server-common ......................... SUCCESS [32.368s]
[INFO] hadoop-yarn-server-nodemanager .................... SUCCESS [4:32.608s]
[INFO] hadoop-yarn-server-web-proxy ...................... SUCCESS [20.306s]
[INFO] hadoop-yarn-server-resourcemanager ................ SUCCESS [15:15.736s]
[INFO] hadoop-yarn-server-tests .......................... SUCCESS [1:22.466s]
[INFO] hadoop-yarn-client ................................ SUCCESS [4:38.364s]
[INFO] hadoop-yarn-applications .......................... SUCCESS [0.099s]
[INFO] hadoop-yarn-applications-distributedshell ......... SUCCESS [1:14.747s]
[INFO] hadoop-yarn-applications-unmanaged-am-launcher .... FAILURE [39.653s]
[INFO] hadoop-yarn-site .................................. SKIPPED
[INFO] hadoop-yarn-project ............................... SKIPPED
[INFO] ------------------------------------------------------------------------
[INFO] BUILD FAILURE
[INFO] ------------------------------------------------------------------------
[INFO] Total time: 33:29.273s
[INFO] Finished at: Sat Dec 28 11:08:16 UTC 2013
[INFO] Final Memory: 54M/632M
[INFO] ------------------------------------------------------------------------
[ERROR] Failed to execute goal org.apache.maven.plugins:maven-surefire-plugin:2.16:test (default-test)
on project hadoop-yarn-applications-unmanaged-am-launcher: There are test failures.
[ERROR] 
[ERROR] Please refer to /home/jenkins/jenkins-slave/workspace/Hadoop-Yarn-trunk/trunk/hadoop-yarn-project/hadoop-yarn/hadoop-yarn-applications/hadoop-yarn-applications-unmanaged-am-launcher/target/surefire-reports
for the individual test results.
[ERROR] -> [Help 1]
[ERROR] 
[ERROR] To see the full stack trace of the errors, re-run Maven with the -e switch.
[ERROR] Re-run Maven using the -X switch to enable full debug logging.
[ERROR] 
[ERROR] For more information about the errors and possible solutions, please read the following
articles:
[ERROR] [Help 1] http://cwiki.apache.org/confluence/display/MAVEN/MojoFailureException
[ERROR] 
[ERROR] After correcting the problems, you can resume the build with the command
[ERROR]   mvn <goals> -rf :hadoop-yarn-applications-unmanaged-am-launcher
Build step 'Execute shell' marked build as failure
Archiving artifacts
Updating YARN-1481
Updating YARN-1541
Updating YARN-1463
Sending e-mails to: yarn-dev@hadoop.apache.org
Email was triggered for: Failure
Sending email for trigger: Failure



###################################################################################
############################## FAILED TESTS (if any) ##############################
No tests ran.
Mime
  • Unnamed multipart/mixed (inline, None, 0 bytes)
View raw message