hadoop-yarn-dev mailing list archives

Site index · List index
Message view « Date » · « Thread »
Top « Date » · « Thread »
From Apache Jenkins Server <jenk...@builds.apache.org>
Subject Hadoop-Yarn-trunk - Build # 432 - Still Failing
Date Wed, 25 Dec 2013 11:00:38 GMT
See https://builds.apache.org/job/Hadoop-Yarn-trunk/432/

###################################################################################
########################## LAST 60 LINES OF THE CONSOLE ###########################
[...truncated 14957 lines...]
	at org.apache.hadoop.service.AbstractService.start(AbstractService.java:193)
	at org.apache.hadoop.service.CompositeService.serviceStart(CompositeService.java:121)
	at org.apache.hadoop.service.AbstractService.start(AbstractService.java:193)
	at org.apache.hadoop.yarn.server.TestContainerManagerSecurity.testContainerManager(TestContainerManagerSecurity.java:110)

Running org.apache.hadoop.yarn.server.TestDiskFailures
Tests run: 3, Failures: 0, Errors: 0, Skipped: 0, Time elapsed: 17.133 sec - in org.apache.hadoop.yarn.server.TestDiskFailures

Results :

Tests in error: 
  TestRMNMSecretKeys.testNMUpdation:49->validateRMNMKeyExchange:69 » NullPointer
  TestContainerManagerSecurity.testContainerManager:110 » YarnRuntime java.io.IO...

Tests run: 7, Failures: 0, Errors: 2, Skipped: 0

[INFO] ------------------------------------------------------------------------
[INFO] Reactor Summary:
[INFO] 
[INFO] hadoop-yarn ....................................... SUCCESS [6.181s]
[INFO] hadoop-yarn-api ................................... SUCCESS [2:30.850s]
[INFO] hadoop-yarn-common ................................ SUCCESS [2:17.309s]
[INFO] hadoop-yarn-server ................................ SUCCESS [0.378s]
[INFO] hadoop-yarn-server-common ......................... SUCCESS [32.435s]
[INFO] hadoop-yarn-server-nodemanager .................... SUCCESS [4:34.121s]
[INFO] hadoop-yarn-server-web-proxy ...................... SUCCESS [21.412s]
[INFO] hadoop-yarn-server-resourcemanager ................ SUCCESS [14:50.731s]
[INFO] hadoop-yarn-server-tests .......................... FAILURE [53.030s]
[INFO] hadoop-yarn-client ................................ SKIPPED
[INFO] hadoop-yarn-applications .......................... SKIPPED
[INFO] hadoop-yarn-applications-distributedshell ......... SKIPPED
[INFO] hadoop-yarn-applications-unmanaged-am-launcher .... SKIPPED
[INFO] hadoop-yarn-site .................................. SKIPPED
[INFO] hadoop-yarn-project ............................... SKIPPED
[INFO] ------------------------------------------------------------------------
[INFO] BUILD FAILURE
[INFO] ------------------------------------------------------------------------
[INFO] Total time: 26:08.954s
[INFO] Finished at: Wed Dec 25 11:00:36 UTC 2013
[INFO] Final Memory: 55M/766M
[INFO] ------------------------------------------------------------------------
[ERROR] Failed to execute goal org.apache.maven.plugins:maven-surefire-plugin:2.16:test (default-test)
on project hadoop-yarn-server-tests: There are test failures.
[ERROR] 
[ERROR] Please refer to /home/jenkins/jenkins-slave/workspace/Hadoop-Yarn-trunk/trunk/hadoop-yarn-project/hadoop-yarn/hadoop-yarn-server/hadoop-yarn-server-tests/target/surefire-reports
for the individual test results.
[ERROR] -> [Help 1]
[ERROR] 
[ERROR] To see the full stack trace of the errors, re-run Maven with the -e switch.
[ERROR] Re-run Maven using the -X switch to enable full debug logging.
[ERROR] 
[ERROR] For more information about the errors and possible solutions, please read the following
articles:
[ERROR] [Help 1] http://cwiki.apache.org/confluence/display/MAVEN/MojoFailureException
[ERROR] 
[ERROR] After correcting the problems, you can resume the build with the command
[ERROR]   mvn <goals> -rf :hadoop-yarn-server-tests
Build step 'Execute shell' marked build as failure
Archiving artifacts
Sending e-mails to: yarn-dev@hadoop.apache.org
Email was triggered for: Failure
Sending email for trigger: Failure



###################################################################################
############################## FAILED TESTS (if any) ##############################
No tests ran.
Mime
  • Unnamed multipart/mixed (inline, None, 0 bytes)
View raw message