hadoop-yarn-dev mailing list archives

Site index · List index
Message view « Date » · « Thread »
Top « Date » · « Thread »
From Apache Jenkins Server <jenk...@builds.apache.org>
Subject Failed: YARN-807 PreCommit Build #2608
Date Fri, 06 Dec 2013 01:51:20 GMT
Jira: https://issues.apache.org/jira/browse/YARN-807
Build: https://builds.apache.org/job/PreCommit-YARN-Build/2608/

###################################################################################
########################## LAST 60 LINES OF THE CONSOLE ###########################
[...truncated 3147 lines...]
NOP




{color:red}-1 overall{color}.  Here are the results of testing the latest attachment 
  http://issues.apache.org/jira/secure/attachment/12617293/YARN-807-3.patch
  against trunk revision .

    {color:green}+1 @author{color}.  The patch does not contain any @author tags.

    {color:green}+1 tests included{color}.  The patch appears to include 4 new or modified
test files.

    {color:green}+1 javac{color}.  The applied patch does not increase the total number of
javac compiler warnings.

    {color:green}+1 javadoc{color}.  The javadoc tool did not generate any warning messages.

    {color:green}+1 eclipse:eclipse{color}.  The patch built with eclipse:eclipse.

    {color:green}+1 findbugs{color}.  The patch does not introduce any new Findbugs (version
1.3.9) warnings.

    {color:green}+1 release audit{color}.  The applied patch does not increase the total number
of release audit warnings.

    {color:red}-1 core tests{color}.  The patch failed these unit tests in hadoop-tools/hadoop-sls
hadoop-yarn-project/hadoop-yarn/hadoop-yarn-server/hadoop-yarn-server-resourcemanager:

                  org.apache.hadoop.yarn.server.resourcemanager.scheduler.fair.TestFairScheduler

    {color:green}+1 contrib tests{color}.  The patch passed contrib unit tests.

Test results: https://builds.apache.org/job/PreCommit-YARN-Build/2608//testReport/
Console output: https://builds.apache.org/job/PreCommit-YARN-Build/2608//console

This message is automatically generated.


======================================================================
======================================================================
    Adding comment to Jira.
======================================================================
======================================================================


Comment added.
afe59e4de74a81235f81a1ff34b77d577ef8618a logged out


======================================================================
======================================================================
    Finished build.
======================================================================
======================================================================


Build step 'Execute shell' marked build as failure
Archiving artifacts
[description-setter] Could not determine description.
Recording test results
Email was triggered for: Failure
Sending email for trigger: Failure



###################################################################################
############################## FAILED TESTS (if any) ##############################
1 tests failed.
FAILED:  org.apache.hadoop.yarn.server.resourcemanager.scheduler.fair.TestFairScheduler.testGetAppsInQueue

Error Message:
null

Stack Trace:
java.lang.NullPointerException: null
	at org.apache.hadoop.yarn.server.resourcemanager.scheduler.fair.FairScheduler.addApplication(FairScheduler.java:605)
	at org.apache.hadoop.yarn.server.resourcemanager.scheduler.fair.TestFairScheduler.createSchedulingRequest(TestFairScheduler.java:259)
	at org.apache.hadoop.yarn.server.resourcemanager.scheduler.fair.TestFairScheduler.createSchedulingRequest(TestFairScheduler.java:247)
	at org.apache.hadoop.yarn.server.resourcemanager.scheduler.fair.TestFairScheduler.createSchedulingRequest(TestFairScheduler.java:237)
	at org.apache.hadoop.yarn.server.resourcemanager.scheduler.fair.TestFairScheduler.testGetAppsInQueue(TestFairScheduler.java:2497)



Mime
  • Unnamed multipart/mixed (inline, None, 0 bytes)
View raw message