hadoop-yarn-dev mailing list archives

Site index · List index
Message view « Date » · « Thread »
Top « Date » · « Thread »
From Apache Jenkins Server <jenk...@builds.apache.org>
Subject Hadoop-Yarn-trunk - Build # 426 - Still Failing
Date Thu, 19 Dec 2013 18:29:50 GMT
See https://builds.apache.org/job/Hadoop-Yarn-trunk/426/

###################################################################################
########################## LAST 60 LINES OF THE CONSOLE ###########################
[...truncated 16248 lines...]
  TestRMAppTransitions.testAppAcceptedKill:615->assertAppAndAttemptKilled:306->assertKilled:294->assertTimesAtFinish:283
application finish time is not greater then 0
  TestRMAppTransitions.testAppKilledKilled:789->assertTimesAtFinish:283 application finish
time is not greater then 0

Tests run: 506, Failures: 2, Errors: 0, Skipped: 1

[INFO] ------------------------------------------------------------------------
[INFO] Reactor Summary:
[INFO] 
[INFO] hadoop-yarn ....................................... SUCCESS [4.181s]
[INFO] hadoop-yarn-api ................................... SUCCESS [2:29.269s]
[INFO] hadoop-yarn-common ................................ SUCCESS [2:16.582s]
[INFO] hadoop-yarn-server ................................ SUCCESS [0.250s]
[INFO] hadoop-yarn-server-common ......................... SUCCESS [30.417s]
[INFO] hadoop-yarn-server-nodemanager .................... SUCCESS [4:34.940s]
[INFO] hadoop-yarn-server-web-proxy ...................... SUCCESS [18.944s]
[INFO] hadoop-yarn-server-resourcemanager ................ FAILURE [14:11.606s]
[INFO] hadoop-yarn-server-tests .......................... SKIPPED
[INFO] hadoop-yarn-client ................................ SKIPPED
[INFO] hadoop-yarn-applications .......................... SKIPPED
[INFO] hadoop-yarn-applications-distributedshell ......... SKIPPED
[INFO] hadoop-yarn-applications-unmanaged-am-launcher .... SKIPPED
[INFO] hadoop-yarn-site .................................. SKIPPED
[INFO] hadoop-yarn-project ............................... SKIPPED
[INFO] ------------------------------------------------------------------------
[INFO] BUILD FAILURE
[INFO] ------------------------------------------------------------------------
[INFO] Total time: 24:28.402s
[INFO] Finished at: Thu Dec 19 18:29:42 UTC 2013
[INFO] Final Memory: 47M/768M
[INFO] ------------------------------------------------------------------------
[ERROR] Failed to execute goal org.apache.maven.plugins:maven-surefire-plugin:2.16:test (default-test)
on project hadoop-yarn-server-resourcemanager: There are test failures.
[ERROR] 
[ERROR] Please refer to /home/jenkins/jenkins-slave/workspace/Hadoop-Yarn-trunk/trunk/hadoop-yarn-project/hadoop-yarn/hadoop-yarn-server/hadoop-yarn-server-resourcemanager/target/surefire-reports
for the individual test results.
[ERROR] -> [Help 1]
[ERROR] 
[ERROR] To see the full stack trace of the errors, re-run Maven with the -e switch.
[ERROR] Re-run Maven using the -X switch to enable full debug logging.
[ERROR] 
[ERROR] For more information about the errors and possible solutions, please read the following
articles:
[ERROR] [Help 1] http://cwiki.apache.org/confluence/display/MAVEN/MojoFailureException
[ERROR] 
[ERROR] After correcting the problems, you can resume the build with the command
[ERROR]   mvn <goals> -rf :hadoop-yarn-server-resourcemanager
Build step 'Execute shell' marked build as failure
Archiving artifacts
Updating YARN-1307
Updating HDFS-5540
Updating HADOOP-10164
Updating YARN-1471
Updating HADOOP-9611
Updating HADOOP-10171
Updating HDFS-5661
Updating HDFS-5662
Updating MAPREDUCE-5687
Updating HDFS-5676
Updating HDFS-5663
Sending e-mails to: yarn-dev@hadoop.apache.org
Email was triggered for: Failure
Sending email for trigger: Failure



###################################################################################
############################## FAILED TESTS (if any) ##############################
No tests ran.
Mime
  • Unnamed multipart/mixed (inline, None, 0 bytes)
View raw message