hadoop-yarn-dev mailing list archives

Site index · List index
Message view « Date » · « Thread »
Top « Date » · « Thread »
From Apache Jenkins Server <jenk...@builds.apache.org>
Subject Failed: YARN-1456 PreCommit Build #2561
Date Thu, 28 Nov 2013 10:22:13 GMT
Jira: https://issues.apache.org/jira/browse/YARN-1456
Build: https://builds.apache.org/job/PreCommit-YARN-Build/2561/

###################################################################################
########################## LAST 60 LINES OF THE CONSOLE ###########################
[...truncated 3115 lines...]



{color:red}-1 overall{color}.  Here are the results of testing the latest attachment 
  http://issues.apache.org/jira/secure/attachment/12616222/YARN-1456-001.patch
  against trunk revision .

    {color:green}+1 @author{color}.  The patch does not contain any @author tags.

    {color:red}-1 tests included{color}.  The patch doesn't appear to include any new or modified
tests.
                        Please justify why no new tests are needed for this patch.
                        Also please list what manual steps were performed to verify this patch.

    {color:green}+1 javac{color}.  The applied patch does not increase the total number of
javac compiler warnings.

    {color:green}+1 javadoc{color}.  The javadoc tool did not generate any warning messages.

    {color:green}+1 eclipse:eclipse{color}.  The patch built with eclipse:eclipse.

    {color:green}+1 findbugs{color}.  The patch does not introduce any new Findbugs (version
1.3.9) warnings.

    {color:green}+1 release audit{color}.  The applied patch does not increase the total number
of release audit warnings.

    {color:red}-1 core tests{color}.  The patch failed these unit tests in hadoop-yarn-project/hadoop-yarn/hadoop-yarn-client
hadoop-yarn-project/hadoop-yarn/hadoop-yarn-server/hadoop-yarn-server-resourcemanager:

                  org.apache.hadoop.yarn.server.resourcemanager.recovery.TestZKRMStateStoreZKClientConnections

    {color:green}+1 contrib tests{color}.  The patch passed contrib unit tests.

Test results: https://builds.apache.org/job/PreCommit-YARN-Build/2561//testReport/
Console output: https://builds.apache.org/job/PreCommit-YARN-Build/2561//console

This message is automatically generated.


======================================================================
======================================================================
    Adding comment to Jira.
======================================================================
======================================================================


Comment added.
e49aad4fbc0bf914c6c4c82c0d1e3f409f1d1df3 logged out


======================================================================
======================================================================
    Finished build.
======================================================================
======================================================================


Build step 'Execute shell' marked build as failure
Archiving artifacts
[description-setter] Could not determine description.
Recording test results
Email was triggered for: Failure
Sending email for trigger: Failure



###################################################################################
############################## FAILED TESTS (if any) ##############################
1 tests failed.
FAILED:  org.apache.hadoop.yarn.server.resourcemanager.recovery.TestZKRMStateStoreZKClientConnections.testZKClientDisconnectAndReconnect

Error Message:
Unable to connect to server

Stack Trace:
java.lang.AssertionError: Unable to connect to server
	at org.junit.Assert.fail(Assert.java:93)
	at org.apache.hadoop.ha.ClientBaseWithFixes.createClient(ClientBaseWithFixes.java:180)
	at org.apache.hadoop.yarn.server.resourcemanager.recovery.TestZKRMStateStoreZKClientConnections.access$100(TestZKRMStateStoreZKClientConnections.java:44)



Mime
  • Unnamed multipart/mixed (inline, None, 0 bytes)
View raw message