hadoop-yarn-dev mailing list archives

Site index · List index
Message view « Date » · « Thread »
Top « Date » · « Thread »
From Apache Jenkins Server <jenk...@builds.apache.org>
Subject Failed: YARN-674 PreCommit Build #2282
Date Fri, 25 Oct 2013 18:07:33 GMT
Jira: https://issues.apache.org/jira/browse/YARN-674
Build: https://builds.apache.org/job/PreCommit-YARN-Build/2282/

###################################################################################
########################## LAST 60 LINES OF THE CONSOLE ###########################
[...truncated 3021 lines...]




{color:red}-1 overall{color}.  Here are the results of testing the latest attachment 
  http://issues.apache.org/jira/secure/attachment/12610181/YARN-674.1.patch
  against trunk revision .

    {color:green}+1 @author{color}.  The patch does not contain any @author tags.

    {color:green}+1 tests included{color}.  The patch appears to include 1 new or modified
test files.

    {color:green}+1 javac{color}.  The applied patch does not increase the total number of
javac compiler warnings.

    {color:green}+1 javadoc{color}.  The javadoc tool did not generate any warning messages.

    {color:green}+1 eclipse:eclipse{color}.  The patch built with eclipse:eclipse.

    {color:red}-1 findbugs{color}.  The patch appears to introduce 2 new Findbugs (version
1.3.9) warnings.

    {color:green}+1 release audit{color}.  The applied patch does not increase the total number
of release audit warnings.

    {color:red}-1 core tests{color}.  The patch failed these unit tests in hadoop-yarn-project/hadoop-yarn/hadoop-yarn-server/hadoop-yarn-server-resourcemanager:

                  org.apache.hadoop.yarn.server.resourcemanager.TestRMRestart

    {color:green}+1 contrib tests{color}.  The patch passed contrib unit tests.

Test results: https://builds.apache.org/job/PreCommit-YARN-Build/2282//testReport/
Findbugs warnings: https://builds.apache.org/job/PreCommit-YARN-Build/2282//artifact/trunk/patchprocess/newPatchFindbugsWarningshadoop-yarn-server-resourcemanager.html
Console output: https://builds.apache.org/job/PreCommit-YARN-Build/2282//console

This message is automatically generated.


======================================================================
======================================================================
    Adding comment to Jira.
======================================================================
======================================================================


Comment added.
942df18714735e694d668cf5d4f8f429b0d604fa logged out


======================================================================
======================================================================
    Finished build.
======================================================================
======================================================================


Build step 'Execute shell' marked build as failure
Archiving artifacts
[description-setter] Could not determine description.
Recording test results
Email was triggered for: Failure
Sending email for trigger: Failure



###################################################################################
############################## FAILED TESTS (if any) ##############################
2 tests failed.
REGRESSION:  org.apache.hadoop.yarn.server.resourcemanager.TestRMRestart.testDelegationTokenRestoredInDelegationTokenRenewer

Error Message:
expected:<[Kind: RM_DELEGATION_TOKEN, Service: localhost:8032, Ident: (owner=user1, renewer=renewer1,
realUser=user1, issueDate=1382724435602, maxDate=1383329235602, sequenceNumber=1, masterKeyId=2),
Kind: RM_DELEGATION_TOKEN, Service: localhost:8032, Ident: (owner=user2, renewer=renewer2,
realUser=user2, issueDate=1382724435603, maxDate=1383329235603, sequenceNumber=2, masterKeyId=2)]>
but was:<[]>

Stack Trace:
java.lang.AssertionError: expected:<[Kind: RM_DELEGATION_TOKEN, Service: localhost:8032,
Ident: (owner=user1, renewer=renewer1, realUser=user1, issueDate=1382724435602, maxDate=1383329235602,
sequenceNumber=1, masterKeyId=2), Kind: RM_DELEGATION_TOKEN, Service: localhost:8032, Ident:
(owner=user2, renewer=renewer2, realUser=user2, issueDate=1382724435603, maxDate=1383329235603,
sequenceNumber=2, masterKeyId=2)]> but was:<[]>
	at org.junit.Assert.fail(Assert.java:93)
	at org.junit.Assert.failNotEquals(Assert.java:647)
	at org.junit.Assert.assertEquals(Assert.java:128)
	at org.junit.Assert.assertEquals(Assert.java:147)
	at org.apache.hadoop.yarn.server.resourcemanager.TestRMRestart.testDelegationTokenRestoredInDelegationTokenRenewer(TestRMRestart.java:499)


REGRESSION:  org.apache.hadoop.yarn.server.resourcemanager.TestRMRestart.testRMDelegationTokenRestoredOnRMRestart

Error Message:
null

Stack Trace:
java.lang.AssertionError: null
	at org.junit.Assert.fail(Assert.java:92)
	at org.junit.Assert.assertTrue(Assert.java:43)
	at org.junit.Assert.assertTrue(Assert.java:54)
	at org.apache.hadoop.yarn.server.resourcemanager.TestRMRestart.testRMDelegationTokenRestoredOnRMRestart(TestRMRestart.java:719)



Mime
  • Unnamed multipart/mixed (inline, None, 0 bytes)
View raw message